{"text_format":"1","workbook":"xlsx","n_sheets":3,"sheets":["Sheet1","Sheet2","Sheet3"],"not_rendered":{"charts":0,"images":9,"macros":1,"external_links":0,"defined_names":7,"comments":0,"pivot_tables":0},"unopened":[],"bounds":{"document_bytes":16777216,"sheet_cells":100000,"rows_first":2000,"rows_last":500,"rows_between":2000,"halvings":0,"cell_chars":16384,"cell_head_chars":4096},"cells_cut":0,"cells_raw":0,"read":"whole","date_system":"1900"}

{"sheet":"Sheet1","index":0,"n_rows":140,"n_cols":114,"rows_kept":140,"cut":false,"hidden":false,"merged":[[54,14,54,16],[30,0,30,3],[28,0,28,2],[31,0,31,3],[7,0,7,2],[24,0,24,3],[26,0,26,3],[29,0,29,2],[11,0,11,3],[13,0,13,3],[0,14,0,16],[3,23,3,25],[3,10,3,11],[3,6,3,7],[3,14,3,15],[3,17,3,19]]}
[null,null,null,null,null,null,null,null,null,null,null,null,null,null,"[ return home ]"]
[]
["Western Lane NFL Pool 2023-24"]
[null,null,null,null,"Week",13,"1st Place",null,{"$f":"IF(Y5<36,ROUNDDOWN((Y5)*5*0.9,0),IF(Y5<42,ROUNDDOWN(((Y5)*5-U4)*0.75,0),ROUNDDOWN(((Y5)*5-U4)*0.65,0)))","v":128},null,{"$f":"IF(Y5<36,\"\",\"2nd Place\")","v":"2nd Place"},null,{"$f":"IF(Y5<36,\"\",ROUNDDOWN(((Y5)*5-U4)*0.25,0))","v":42},null,{"$f":"IF(Y5<42,\"\",\"3rd Place\")","v":""},null,{"$f":"IF(Y5<42,\"\",ROUNDUP(((Y5)*5-U4)*0.1,0))","v":""},"Total wins pot",null,null,{"$f":"ROUNDUP((Y5)*5*0.1,0)","v":19},null,null,"Total Entries"]
["Week 13",null,null,null,"Place a capital X to the right of the winning team, then press 'Ctrl n' to sort the results below",null,null,null,null,null,null,null,null,null,null,null,null,null,null,null,null,null,null,null,{"$f":"SUM(E7:DF7)","v":38}]
[null,null,null,null,"Shaded games indicate all entries picked the same team.  These games have no effect on this week's results."]
["Away",null,"Home",null,"Aaron S",{"$f":"IF(E9=\"\",\"\",1)","v":1},"Andy B",{"$f":"IF(G9=\"\",\"\",1)","v":1},"Bake",{"$f":"IF(I9=\"\",\"\",1)","v":1},"Brandon",{"$f":"IF(K9=\"\",\"\",1)","v":""},"Carol",{"$f":"IF(M9=\"\",\"\",1)","v":1},"Casey",{"$f":"IF(O9=\"\",\"\",1)","v":1},"Chris C",{"$f":"IF(Q9=\"\",\"\",1)","v":1},"Chris M",{"$f":"IF(S9=\"\",\"\",1)","v":1},"Chuck L",{"$f":"IF(U9=\"\",\"\",1)","v":1},"Clevelander1",{"$f":"IF(W9=\"\",\"\",1)","v":1},"Clevelander2",{"$f":"IF(Y9=\"\",\"\",1)","v":1},"Dave H",{"$f":"IF(AA9=\"\",\"\",1)","v":1},"Dsok",{"$f":"IF(AC9=\"\",\"\",1)","v":1},"Hudie",{"$f":"IF(AE9=\"\",\"\",1)","v":1},"Jan",{"$f":"IF(AG9=\"\",\"\",1)","v":1},"Julie",{"$f":"IF(AI9=\"\",\"\",1)","v":1},"KCIV",{"$f":"IF(AK9=\"\",\"\",1)","v":1},"Keith M",{"$f":"IF(AM9=\"\",\"\",1)","v":1},"Kevin L",{"$f":"IF(AO9=\"\",\"\",1)","v":1},"Kristin",{"$f":"IF(AQ9=\"\",\"\",1)","v":""},"Lisa",{"$f":"IF(AS9=\"\",\"\",1)","v":1},"Lee",{"$f":"IF(AU9=\"\",\"\",1)","v":1},"Lucky Lady",{"$f":"IF(AW9=\"\",\"\",1)","v":1},"Lord Nulsen",{"$f":"IF(AY9=\"\",\"\",1)","v":1},"LoveyD",{"$f":"IF(BA9=\"\",\"\",1)","v":1},"Lynne",{"$f":"IF(BC9=\"\",\"\",1)","v":1},"Mike K",{"$f":"IF(BE9=\"\",\"\",1)","v":1},"Miss Chris",{"$f":"IF(BG9=\"\",\"\",1)","v":1},"Pat",{"$f":"IF(BI9=\"\",\"\",1)","v":1},"Peter S",{"$f":"IF(BK9=\"\",\"\",1)","v":1},"Pickled",{"$f":"IF(BM9=\"\",\"\",1)","v":1},"Posh",{"$f":"IF(BO9=\"\",\"\",1)","v":1},"Ralph",{"$f":"IF(BQ9=\"\",\"\",1)","v":1},"Ryan M",{"$f":"IF(BS9=\"\",\"\",1)","v":1},"Saxman",{"$f":"IF(BU9=\"\",\"\",1)","v":1},"Shoes",{"$f":"IF(BW9=\"\",\"\",1)","v":""},"Sky King",{"$f":"IF(BY9=\"\",\"\",1)","v":1},"Snake",{"$f":"IF(CA9=\"\",\"\",1)","v":""},"Triple B's",{"$f":"IF(CC9=\"\",\"\",1)","v":1},"Wayne D",{"$f":"IF(CE9=\"\",\"\",1)","v":1},"Wayne K1",{"$f":"IF(CG9=\"\",\"\",1)","v":1},"Wayne K2",{"$f":"IF(CI10=\"\",\"\",1)","v":1},null,{"$f":"IF(CK10=\"\",\"\",1)","v":""},null,{"$f":"IF(CM10=\"\",\"\",1)","v":""},null,{"$f":"IF(CO10=\"\",\"\",1)","v":""},null,{"$f":"IF(CQ10=\"\",\"\",1)","v":""},null,{"$f":"IF(CS10=\"\",\"\",1)","v":""},null,{"$f":"IF(CU10=\"\",\"\",1)","v":""},null,{"$f":"IF(CW10=\"\",\"\",1)","v":""},null,{"$f":"IF(CY10=\"\",\"\",1)","v":""},null,{"$f":"IF(DA10=\"\",\"\",1)","v":""},null,{"$f":"IF(DC10=\"\",\"\",1)","v":""},null,{"$f":"IF(DE10=\"\",\"\",1)","v":""}]
["Thankgiving Games"]
["CHI",null,"DET","X","DET",{"$f":"IF($B9=\"X\",IF(E9=$A9,1,0),IF(E9=$C9,IF($D9=\"X\",1,0),0))","v":1},"DET",{"$f":"IF($B9=\"X\",IF(G9=$A9,1,0),IF(G9=$C9,IF($D9=\"X\",1,0),0))","v":1},"DET",{"$f":"IF($B9=\"X\",IF(I9=$A9,1,0),IF(I9=$C9,IF($D9=\"X\",1,0),0))","v":1},null,{"$f":"IF($B9=\"X\",IF(K9=$A9,1,0),IF(K9=$C9,IF($D9=\"X\",1,0),0))","v":0},"DET",{"$f":"IF($B9=\"X\",IF(M9=$A9,1,0),IF(M9=$C9,IF($D9=\"X\",1,0),0))","v":1},"DET",{"$f":"IF($B9=\"X\",IF(O9=$A9,1,0),IF(O9=$C9,IF($D9=\"X\",1,0),0))","v":1},"DET",{"$f":"IF($B9=\"X\",IF(Q9=$A9,1,0),IF(Q9=$C9,IF($D9=\"X\",1,0),0))","v":1},"DET",{"$f":"IF($B9=\"X\",IF(S9=$A9,1,0),IF(S9=$C9,IF($D9=\"X\",1,0),0))","v":1},"DET",{"$f":"IF($B9=\"X\",IF(U9=$A9,1,0),IF(U9=$C9,IF($D9=\"X\",1,0),0))","v":1},"DET",{"$f":"IF($B9=\"X\",IF(W9=$A9,1,0),IF(W9=$C9,IF($D9=\"X\",1,0),0))","v":1},"DET",{"$f":"IF($B9=\"X\",IF(Y9=$A9,1,0),IF(Y9=$C9,IF($D9=\"X\",1,0),0))","v":1},"DET",{"$f":"IF($B9=\"X\",IF(AA9=$A9,1,0),IF(AA9=$C9,IF($D9=\"X\",1,0),0))","v":1},"DET",{"$f":"IF($B9=\"X\",IF(AC9=$A9,1,0),IF(AC9=$C9,IF($D9=\"X\",1,0),0))","v":1},"DET",{"$f":"IF($B9=\"X\",IF(AE9=$A9,1,0),IF(AE9=$C9,IF($D9=\"X\",1,0),0))","v":1},"DET",{"$f":"IF($B9=\"X\",IF(AG9=$A9,1,0),IF(AG9=$C9,IF($D9=\"X\",1,0),0))","v":1},"DET",{"$f":"IF($B9=\"X\",IF(AI9=$A9,1,0),IF(AI9=$C9,IF($D9=\"X\",1,0),0))","v":1},"DET",{"$f":"IF($B9=\"X\",IF(AK9=$A9,1,0),IF(AK9=$C9,IF($D9=\"X\",1,0),0))","v":1},"DET",{"$f":"IF($B9=\"X\",IF(AM9=$A9,1,0),IF(AM9=$C9,IF($D9=\"X\",1,0),0))","v":1},"DET",{"$f":"IF($B9=\"X\",IF(AO9=$A9,1,0),IF(AO9=$C9,IF($D9=\"X\",1,0),0))","v":1},null,{"$f":"IF($B9=\"X\",IF(AQ9=$A9,1,0),IF(AQ9=$C9,IF($D9=\"X\",1,0),0))","v":0},"DET",{"$f":"IF($B9=\"X\",IF(AS9=$A9,1,0),IF(AS9=$C9,IF($D9=\"X\",1,0),0))","v":1},"DET",{"$f":"IF($B9=\"X\",IF(AU9=$A9,1,0),IF(AU9=$C9,IF($D9=\"X\",1,0),0))","v":1},"DET",{"$f":"IF($B9=\"X\",IF(AW9=$A9,1,0),IF(AW9=$C9,IF($D9=\"X\",1,0),0))","v":1},"DET",{"$f":"IF($B9=\"X\",IF(AY9=$A9,1,0),IF(AY9=$C9,IF($D9=\"X\",1,0),0))","v":1},"DET",{"$f":"IF($B9=\"X\",IF(BA9=$A9,1,0),IF(BA9=$C9,IF($D9=\"X\",1,0),0))","v":1},"DET",{"$f":"IF($B9=\"X\",IF(BC9=$A9,1,0),IF(BC9=$C9,IF($D9=\"X\",1,0),0))","v":1},"DET",{"$f":"IF($B9=\"X\",IF(BE9=$A9,1,0),IF(BE9=$C9,IF($D9=\"X\",1,0),0))","v":1},"DET",{"$f":"IF($B9=\"X\",IF(BG9=$A9,1,0),IF(BG9=$C9,IF($D9=\"X\",1,0),0))","v":1},"DET",{"$f":"IF($B9=\"X\",IF(BI9=$A9,1,0),IF(BI9=$C9,IF($D9=\"X\",1,0),0))","v":1},"DET",{"$f":"IF($B9=\"X\",IF(BK9=$A9,1,0),IF(BK9=$C9,IF($D9=\"X\",1,0),0))","v":1},"DET",{"$f":"IF($B9=\"X\",IF(BM9=$A9,1,0),IF(BM9=$C9,IF($D9=\"X\",1,0),0))","v":1},"DET",{"$f":"IF($B9=\"X\",IF(BO9=$A9,1,0),IF(BO9=$C9,IF($D9=\"X\",1,0),0))","v":1},"DET",{"$f":"IF($B9=\"X\",IF(BQ9=$A9,1,0),IF(BQ9=$C9,IF($D9=\"X\",1,0),0))","v":1},"DET",{"$f":"IF($B9=\"X\",IF(BS9=$A9,1,0),IF(BS9=$C9,IF($D9=\"X\",1,0),0))","v":1},"DET",{"$f":"IF($B9=\"X\",IF(BU9=$A9,1,0),IF(BU9=$C9,IF($D9=\"X\",1,0),0))","v":1},null,{"$f":"IF($B9=\"X\",IF(BW9=$A9,1,0),IF(BW9=$C9,IF($D9=\"X\",1,0),0))","v":0},"DET",{"$f":"IF($B9=\"X\",IF(BY9=$A9,1,0),IF(BY9=$C9,IF($D9=\"X\",1,0),0))","v":1},null,{"$f":"IF($B9=\"X\",IF(CA9=$A9,1,0),IF(CA9=$C9,IF($D9=\"X\",1,0),0))","v":0},"DET",{"$f":"IF($B9=\"X\",IF(CC9=$A9,1,0),IF(CC9=$C9,IF($D9=\"X\",1,0),0))","v":1},"DET",{"$f":"IF($B9=\"X\",IF(CE9=$A9,1,0),IF(CE9=$C9,IF($D9=\"X\",1,0),0))","v":1},"DET",{"$f":"IF($B9=\"X\",IF(CG9=$A9,1,0),IF(CG9=$C9,IF($D9=\"X\",1,0),0))","v":1},"DET",{"$f":"IF($B9=\"X\",IF(CI9=$A9,1,0),IF(CI9=$C9,IF($D9=\"X\",1,0),0))","v":1},null,{"$f":"IF($B9=\"X\",IF(CK9=$A9,1,0),IF(CK9=$C9,IF($D9=\"X\",1,0),0))","v":0},null,{"$f":"IF($B9=\"X\",IF(CM9=$A9,1,0),IF(CM9=$C9,IF($D9=\"X\",1,0),0))","v":0},null,{"$f":"IF($B9=\"X\",IF(CO9=$A9,1,0),IF(CO9=$C9,IF($D9=\"X\",1,0),0))","v":0},null,{"$f":"IF($B9=\"X\",IF(CQ9=$A9,1,0),IF(CQ9=$C9,IF($D9=\"X\",1,0),0))","v":0},null,{"$f":"IF($B9=\"X\",IF(CS9=$A9,1,0),IF(CS9=$C9,IF($D9=\"X\",1,0),0))","v":0},null,{"$f":"IF($B9=\"X\",IF(CU9=$A9,1,0),IF(CU9=$C9,IF($D9=\"X\",1,0),0))","v":0},null,{"$f":"IF($B9=\"X\",IF(CW9=$A9,1,0),IF(CW9=$C9,IF($D9=\"X\",1,0),0))","v":0},null,{"$f":"IF($B9=\"X\",IF(CY9=$A9,1,0),IF(CY9=$C9,IF($D9=\"X\",1,0),0))","v":0},null,{"$f":"IF($B9=\"X\",IF(DA9=$A9,1,0),IF(DA9=$C9,IF($D9=\"X\",1,0),0))","v":0},null,{"$f":"IF($B9=\"X\",IF(DC9=$A9,1,0),IF(DC9=$C9,IF($D9=\"X\",1,0),0))","v":0},null,{"$f":"IF($B9=\"X\",IF(DE9=$A9,1,0),IF(DE9=$C9,IF($D9=\"X\",1,0),0))","v":0},null,null,{"$f":"IF(DJ9=$Y$5,\"*\",IF(DJ9=0,\"*\",\"\"))","v":"*"},{"$f":"SUM(E9:DF9)","v":38}]
["NYG",null,"DAL","X","DAL",1,"DAL",1,"DAL",1,null,0,"DAL",1,"DAL",1,"DAL",1,"DAL",1,"DAL",1,"DAL",1,"DAL",1,"DAL",1,"DAL",1,"DAL",1,"DAL",1,"DAL",1,"DAL",1,"DAL",1,"DAL",1,null,0,"DAL",1,"DAL",1,"DAL",1,"DAL",1,"DAL",1,"DAL",1,"DAL",1,"DAL",1,"DAL",1,"DAL",1,"DAL",1,"DAL",1,"DAL",1,"DAL",1,"DAL",1,null,0,"DAL",1,null,0,"DAL",1,"DAL",1,"DAL",1,"DAL",1,null,0,null,0,null,0,null,0,null,0,null,0,null,0,null,0,null,0,null,0,null,0,null,null,"*",{"$f":"SUM(E10:DF10)","v":38}]
["MIA",null,"GB","X","GB",1,"GB",1,"GB",1,null,0,"MIA",0,"GB",1,"GB",1,"GB",1,"GB",1,"GB",1,"GB",1,"MIA",0,"GB",1,"MIA",0,"GB",1,"GB",1,"GB",1,"GB",1,"GB",1,null,0,"MIA",0,"MIA",0,"GB",1,"MIA",0,"MIA",0,"GB",1,"GB",1,"GB",1,"GB",1,"GB",1,"GB",1,"MIA",0,"GB",1,"GB",1,"GB",1,null,0,"GB",1,null,0,"GB",1,"GB",1,"GB",1,"GB",1,null,0,null,0,null,0,null,0,null,0,null,0,null,0,null,0,null,0,null,0,null,0,null,null,"",30]
["Friday Game"]
["LV",null,"KC","X","KC",{"$f":"IF($B13=\"X\",IF(E13=$A13,1,0),IF(E13=$C13,IF($D13=\"X\",1,0),0))","v":1},"KC",{"$f":"IF($B13=\"X\",IF(G13=$A13,1,0),IF(G13=$C13,IF($D13=\"X\",1,0),0))","v":1},"KC",{"$f":"IF($B13=\"X\",IF(I13=$A13,1,0),IF(I13=$C13,IF($D13=\"X\",1,0),0))","v":1},null,{"$f":"IF($B13=\"X\",IF(K13=$A13,1,0),IF(K13=$C13,IF($D13=\"X\",1,0),0))","v":0},"KC",{"$f":"IF($B13=\"X\",IF(M13=$A13,1,0),IF(M13=$C13,IF($D13=\"X\",1,0),0))","v":1},"KC",{"$f":"IF($B13=\"X\",IF(O13=$A13,1,0),IF(O13=$C13,IF($D13=\"X\",1,0),0))","v":1},"KC",{"$f":"IF($B13=\"X\",IF(Q13=$A13,1,0),IF(Q13=$C13,IF($D13=\"X\",1,0),0))","v":1},"KC",{"$f":"IF($B13=\"X\",IF(S13=$A13,1,0),IF(S13=$C13,IF($D13=\"X\",1,0),0))","v":1},"KC",{"$f":"IF($B13=\"X\",IF(U13=$A13,1,0),IF(U13=$C13,IF($D13=\"X\",1,0),0))","v":1},"KC",{"$f":"IF($B13=\"X\",IF(W13=$A13,1,0),IF(W13=$C13,IF($D13=\"X\",1,0),0))","v":1},"KC",{"$f":"IF($B13=\"X\",IF(Y13=$A13,1,0),IF(Y13=$C13,IF($D13=\"X\",1,0),0))","v":1},"KC",{"$f":"IF($B13=\"X\",IF(AA13=$A13,1,0),IF(AA13=$C13,IF($D13=\"X\",1,0),0))","v":1},"KC",{"$f":"IF($B13=\"X\",IF(AC13=$A13,1,0),IF(AC13=$C13,IF($D13=\"X\",1,0),0))","v":1},"KC",{"$f":"IF($B13=\"X\",IF(AE13=$A13,1,0),IF(AE13=$C13,IF($D13=\"X\",1,0),0))","v":1},"KC",{"$f":"IF($B13=\"X\",IF(AG13=$A13,1,0),IF(AG13=$C13,IF($D13=\"X\",1,0),0))","v":1},"KC",{"$f":"IF($B13=\"X\",IF(AI13=$A13,1,0),IF(AI13=$C13,IF($D13=\"X\",1,0),0))","v":1},"KC",{"$f":"IF($B13=\"X\",IF(AK13=$A13,1,0),IF(AK13=$C13,IF($D13=\"X\",1,0),0))","v":1},"KC",{"$f":"IF($B13=\"X\",IF(AM13=$A13,1,0),IF(AM13=$C13,IF($D13=\"X\",1,0),0))","v":1},"KC",{"$f":"IF($B13=\"X\",IF(AO13=$A13,1,0),IF(AO13=$C13,IF($D13=\"X\",1,0),0))","v":1},null,{"$f":"IF($B13=\"X\",IF(AQ13=$A13,1,0),IF(AQ13=$C13,IF($D13=\"X\",1,0),0))","v":0},"KC",{"$f":"IF($B13=\"X\",IF(AS13=$A13,1,0),IF(AS13=$C13,IF($D13=\"X\",1,0),0))","v":1},"KC",{"$f":"IF($B13=\"X\",IF(AU13=$A13,1,0),IF(AU13=$C13,IF($D13=\"X\",1,0),0))","v":1},"KC",{"$f":"IF($B13=\"X\",IF(AW13=$A13,1,0),IF(AW13=$C13,IF($D13=\"X\",1,0),0))","v":1},"KC",{"$f":"IF($B13=\"X\",IF(AY13=$A13,1,0),IF(AY13=$C13,IF($D13=\"X\",1,0),0))","v":1},"KC",{"$f":"IF($B13=\"X\",IF(BA13=$A13,1,0),IF(BA13=$C13,IF($D13=\"X\",1,0),0))","v":1},"KC",{"$f":"IF($B13=\"X\",IF(BC13=$A13,1,0),IF(BC13=$C13,IF($D13=\"X\",1,0),0))","v":1},"KC",{"$f":"IF($B13=\"X\",IF(BE13=$A13,1,0),IF(BE13=$C13,IF($D13=\"X\",1,0),0))","v":1},"KC",{"$f":"IF($B13=\"X\",IF(BG13=$A13,1,0),IF(BG13=$C13,IF($D13=\"X\",1,0),0))","v":1},"KC",{"$f":"IF($B13=\"X\",IF(BI13=$A13,1,0),IF(BI13=$C13,IF($D13=\"X\",1,0),0))","v":1},"KC",{"$f":"IF($B13=\"X\",IF(BK13=$A13,1,0),IF(BK13=$C13,IF($D13=\"X\",1,0),0))","v":1},"KC",{"$f":"IF($B13=\"X\",IF(BM13=$A13,1,0),IF(BM13=$C13,IF($D13=\"X\",1,0),0))","v":1},"KC",{"$f":"IF($B13=\"X\",IF(BO13=$A13,1,0),IF(BO13=$C13,IF($D13=\"X\",1,0),0))","v":1},"KC",{"$f":"IF($B13=\"X\",IF(BQ13=$A13,1,0),IF(BQ13=$C13,IF($D13=\"X\",1,0),0))","v":1},"KC",{"$f":"IF($B13=\"X\",IF(BS13=$A13,1,0),IF(BS13=$C13,IF($D13=\"X\",1,0),0))","v":1},"KC",{"$f":"IF($B13=\"X\",IF(BU13=$A13,1,0),IF(BU13=$C13,IF($D13=\"X\",1,0),0))","v":1},null,{"$f":"IF($B13=\"X\",IF(BW13=$A13,1,0),IF(BW13=$C13,IF($D13=\"X\",1,0),0))","v":0},"KC",{"$f":"IF($B13=\"X\",IF(BY13=$A13,1,0),IF(BY13=$C13,IF($D13=\"X\",1,0),0))","v":1},null,{"$f":"IF($B13=\"X\",IF(CA13=$A13,1,0),IF(CA13=$C13,IF($D13=\"X\",1,0),0))","v":0},"KC",{"$f":"IF($B13=\"X\",IF(CC13=$A13,1,0),IF(CC13=$C13,IF($D13=\"X\",1,0),0))","v":1},"KC",{"$f":"IF($B13=\"X\",IF(CE13=$A13,1,0),IF(CE13=$C13,IF($D13=\"X\",1,0),0))","v":1},"KC",{"$f":"IF($B13=\"X\",IF(CG13=$A13,1,0),IF(CG13=$C13,IF($D13=\"X\",1,0),0))","v":1},"KC",{"$f":"IF($B13=\"X\",IF(CI13=$A13,1,0),IF(CI13=$C13,IF($D13=\"X\",1,0),0))","v":1},null,{"$f":"IF($B13=\"X\",IF(CK13=$A13,1,0),IF(CK13=$C13,IF($D13=\"X\",1,0),0))","v":0},null,{"$f":"IF($B13=\"X\",IF(CM13=$A13,1,0),IF(CM13=$C13,IF($D13=\"X\",1,0),0))","v":0},null,{"$f":"IF($B13=\"X\",IF(CO13=$A13,1,0),IF(CO13=$C13,IF($D13=\"X\",1,0),0))","v":0},null,{"$f":"IF($B13=\"X\",IF(CQ13=$A13,1,0),IF(CQ13=$C13,IF($D13=\"X\",1,0),0))","v":0},null,{"$f":"IF($B13=\"X\",IF(CS13=$A13,1,0),IF(CS13=$C13,IF($D13=\"X\",1,0),0))","v":0},null,{"$f":"IF($B13=\"X\",IF(CU13=$A13,1,0),IF(CU13=$C13,IF($D13=\"X\",1,0),0))","v":0},null,{"$f":"IF($B13=\"X\",IF(CW13=$A13,1,0),IF(CW13=$C13,IF($D13=\"X\",1,0),0))","v":0},null,{"$f":"IF($B13=\"X\",IF(CY13=$A13,1,0),IF(CY13=$C13,IF($D13=\"X\",1,0),0))","v":0},null,{"$f":"IF($B13=\"X\",IF(DA13=$A13,1,0),IF(DA13=$C13,IF($D13=\"X\",1,0),0))","v":0},null,{"$f":"IF($B13=\"X\",IF(DC13=$A13,1,0),IF(DC13=$C13,IF($D13=\"X\",1,0),0))","v":0},null,{"$f":"IF($B13=\"X\",IF(DE13=$A13,1,0),IF(DE13=$C13,IF($D13=\"X\",1,0),0))","v":0},null,null,{"$f":"IF(DJ13=$Y$5,\"*\",IF(DJ13=0,\"*\",\"\"))","v":"*"},{"$f":"SUM(E13:DF13)","v":38}]
["Sunday Games"]
["LAC","X","ATL",null,"LAC",1,"LAC",1,"LAC",1,null,0,"LAC",1,"LAC",1,"LAC",1,"ATL",0,"LAC",1,"ATL",0,"LAC",1,"ATL",{"$f":"IF($B15=\"X\",IF(AA15=$A15,1,0),IF(AA15=$C15,IF($D15=\"X\",1,0),0))","v":0},"LAC",{"$f":"IF($B15=\"X\",IF(AC15=$A15,1,0),IF(AC15=$C15,IF($D15=\"X\",1,0),0))","v":1},"LAC",{"$f":"IF($B15=\"X\",IF(AE15=$A15,1,0),IF(AE15=$C15,IF($D15=\"X\",1,0),0))","v":1},"LAC",{"$f":"IF($B15=\"X\",IF(AG15=$A15,1,0),IF(AG15=$C15,IF($D15=\"X\",1,0),0))","v":1},"ATL",{"$f":"IF($B15=\"X\",IF(AI15=$A15,1,0),IF(AI15=$C15,IF($D15=\"X\",1,0),0))","v":0},"LAC",{"$f":"IF($B15=\"X\",IF(AK15=$A15,1,0),IF(AK15=$C15,IF($D15=\"X\",1,0),0))","v":1},"LAC",{"$f":"IF($B15=\"X\",IF(AM15=$A15,1,0),IF(AM15=$C15,IF($D15=\"X\",1,0),0))","v":1},"ATL",{"$f":"IF($B15=\"X\",IF(AO15=$A15,1,0),IF(AO15=$C15,IF($D15=\"X\",1,0),0))","v":0},null,{"$f":"IF($B15=\"X\",IF(AQ15=$A15,1,0),IF(AQ15=$C15,IF($D15=\"X\",1,0),0))","v":0},"LAC",{"$f":"IF($B15=\"X\",IF(AS15=$A15,1,0),IF(AS15=$C15,IF($D15=\"X\",1,0),0))","v":1},"LAC",{"$f":"IF($B15=\"X\",IF(AU15=$A15,1,0),IF(AU15=$C15,IF($D15=\"X\",1,0),0))","v":1},"ATL",{"$f":"IF($B15=\"X\",IF(AW15=$A15,1,0),IF(AW15=$C15,IF($D15=\"X\",1,0),0))","v":0},"ATL",{"$f":"IF($B15=\"X\",IF(AY15=$A15,1,0),IF(AY15=$C15,IF($D15=\"X\",1,0),0))","v":0},"ATL",{"$f":"IF($B15=\"X\",IF(BA15=$A15,1,0),IF(BA15=$C15,IF($D15=\"X\",1,0),0))","v":0},"LAC",{"$f":"IF($B15=\"X\",IF(BC15=$A15,1,0),IF(BC15=$C15,IF($D15=\"X\",1,0),0))","v":1},"LAC",{"$f":"IF($B15=\"X\",IF(BE15=$A15,1,0),IF(BE15=$C15,IF($D15=\"X\",1,0),0))","v":1},"LAC",{"$f":"IF($B15=\"X\",IF(BG15=$A15,1,0),IF(BG15=$C15,IF($D15=\"X\",1,0),0))","v":1},"ATL",{"$f":"IF($B15=\"X\",IF(BI15=$A15,1,0),IF(BI15=$C15,IF($D15=\"X\",1,0),0))","v":0},"LAC",{"$f":"IF($B15=\"X\",IF(BK15=$A15,1,0),IF(BK15=$C15,IF($D15=\"X\",1,0),0))","v":1},"ATL",{"$f":"IF($B15=\"X\",IF(BM15=$A15,1,0),IF(BM15=$C15,IF($D15=\"X\",1,0),0))","v":0},"LAC",{"$f":"IF($B15=\"X\",IF(BO15=$A15,1,0),IF(BO15=$C15,IF($D15=\"X\",1,0),0))","v":1},"ATL",{"$f":"IF($B15=\"X\",IF(BQ15=$A15,1,0),IF(BQ15=$C15,IF($D15=\"X\",1,0),0))","v":0},"LAC",{"$f":"IF($B15=\"X\",IF(BS15=$A15,1,0),IF(BS15=$C15,IF($D15=\"X\",1,0),0))","v":1},"LAC",{"$f":"IF($B15=\"X\",IF(BU15=$A15,1,0),IF(BU15=$C15,IF($D15=\"X\",1,0),0))","v":1},null,{"$f":"IF($B15=\"X\",IF(BW15=$A15,1,0),IF(BW15=$C15,IF($D15=\"X\",1,0),0))","v":0},"ATL",{"$f":"IF($B15=\"X\",IF(BY15=$A15,1,0),IF(BY15=$C15,IF($D15=\"X\",1,0),0))","v":0},null,{"$f":"IF($B15=\"X\",IF(CA15=$A15,1,0),IF(CA15=$C15,IF($D15=\"X\",1,0),0))","v":0},"LAC",{"$f":"IF($B15=\"X\",IF(CC15=$A15,1,0),IF(CC15=$C15,IF($D15=\"X\",1,0),0))","v":1},"ATL",{"$f":"IF($B15=\"X\",IF(CE15=$A15,1,0),IF(CE15=$C15,IF($D15=\"X\",1,0),0))","v":0},"LAC",{"$f":"IF($B15=\"X\",IF(CG15=$A15,1,0),IF(CG15=$C15,IF($D15=\"X\",1,0),0))","v":1},"LAC",{"$f":"IF($B15=\"X\",IF(CI15=$A15,1,0),IF(CI15=$C15,IF($D15=\"X\",1,0),0))","v":1},null,{"$f":"IF($B15=\"X\",IF(CK15=$A15,1,0),IF(CK15=$C15,IF($D15=\"X\",1,0),0))","v":0},null,{"$f":"IF($B15=\"X\",IF(CM15=$A15,1,0),IF(CM15=$C15,IF($D15=\"X\",1,0),0))","v":0},null,{"$f":"IF($B15=\"X\",IF(CO15=$A15,1,0),IF(CO15=$C15,IF($D15=\"X\",1,0),0))","v":0},null,{"$f":"IF($B15=\"X\",IF(CQ15=$A15,1,0),IF(CQ15=$C15,IF($D15=\"X\",1,0),0))","v":0},null,{"$f":"IF($B15=\"X\",IF(CS15=$A15,1,0),IF(CS15=$C15,IF($D15=\"X\",1,0),0))","v":0},null,{"$f":"IF($B15=\"X\",IF(CU15=$A15,1,0),IF(CU15=$C15,IF($D15=\"X\",1,0),0))","v":0},null,{"$f":"IF($B15=\"X\",IF(CW15=$A15,1,0),IF(CW15=$C15,IF($D15=\"X\",1,0),0))","v":0},null,{"$f":"IF($B15=\"X\",IF(CY15=$A15,1,0),IF(CY15=$C15,IF($D15=\"X\",1,0),0))","v":0},null,{"$f":"IF($B15=\"X\",IF(DA15=$A15,1,0),IF(DA15=$C15,IF($D15=\"X\",1,0),0))","v":0},null,{"$f":"IF($B15=\"X\",IF(DC15=$A15,1,0),IF(DC15=$C15,IF($D15=\"X\",1,0),0))","v":0},null,{"$f":"IF($B15=\"X\",IF(DE15=$A15,1,0),IF(DE15=$C15,IF($D15=\"X\",1,0),0))","v":0},null,null,"",25]
["PIT","X","CIN",null,"CIN",0,"CIN",0,"CIN",0,null,0,"CIN",0,"CIN",0,"PIT",1,"PIT",1,"PIT",1,"CIN",0,"CIN",0,"CIN",0,"CIN",0,"PIT",1,"PIT",1,"PIT",1,"PIT",1,"PIT",1,"CIN",0,null,0,"CIN",0,"PIT",1,"CIN",0,"CIN",0,"PIT",1,"CIN",0,"PIT",1,"CIN",0,"CIN",0,"PIT",1,"CIN",0,"PIT",1,"PIT",1,"PIT",1,"CIN",0,null,0,"CIN",0,null,0,"PIT",1,"CIN",0,"CIN",0,"PIT",1,null,0,null,0,null,0,null,0,null,0,null,0,null,0,null,0,null,0,null,0,null,0,null,null,"",17]
["AZ",null,"MIN","X","MIN",{"$f":"IF($B17=\"X\",IF(E17=$A17,1,0),IF(E17=$C17,IF($D17=\"X\",1,0),0))","v":1},"MIN",{"$f":"IF($B17=\"X\",IF(G17=$A17,1,0),IF(G17=$C17,IF($D17=\"X\",1,0),0))","v":1},"MIN",{"$f":"IF($B17=\"X\",IF(I17=$A17,1,0),IF(I17=$C17,IF($D17=\"X\",1,0),0))","v":1},null,{"$f":"IF($B17=\"X\",IF(K17=$A17,1,0),IF(K17=$C17,IF($D17=\"X\",1,0),0))","v":0},"AZ",{"$f":"IF($B17=\"X\",IF(M17=$A17,1,0),IF(M17=$C17,IF($D17=\"X\",1,0),0))","v":0},"MIN",{"$f":"IF($B17=\"X\",IF(O17=$A17,1,0),IF(O17=$C17,IF($D17=\"X\",1,0),0))","v":1},"AZ",{"$f":"IF($B17=\"X\",IF(Q17=$A17,1,0),IF(Q17=$C17,IF($D17=\"X\",1,0),0))","v":0},"MIN",{"$f":"IF($B17=\"X\",IF(S17=$A17,1,0),IF(S17=$C17,IF($D17=\"X\",1,0),0))","v":1},"MIN",{"$f":"IF($B17=\"X\",IF(U17=$A17,1,0),IF(U17=$C17,IF($D17=\"X\",1,0),0))","v":1},"MIN",{"$f":"IF($B17=\"X\",IF(W17=$A17,1,0),IF(W17=$C17,IF($D17=\"X\",1,0),0))","v":1},"AZ",{"$f":"IF($B17=\"X\",IF(Y17=$A17,1,0),IF(Y17=$C17,IF($D17=\"X\",1,0),0))","v":0},"MIN",1,"MIN",1,"MIN",1,"MIN",1,"MIN",1,"MIN",1,"MIN",1,"MIN",1,null,0,"MIN",1,"MIN",1,"MIN",1,"AZ",0,"MIN",1,"MIN",1,"MIN",1,"MIN",1,"MIN",1,"MIN",1,"MIN",1,"MIN",1,"MIN",1,"MIN",1,"MIN",1,null,0,"MIN",1,null,0,"MIN",1,"MIN",1,"MIN",1,"MIN",1,null,0,null,0,null,0,null,0,null,0,null,0,null,0,null,0,null,0,null,0,null,0,null,null,{"$f":"IF(DJ17=$Y$5,\"*\",IF(DJ17=0,\"*\",\"\"))","v":""},34]
["IND","X","NE",null,"IND",1,"IND",1,"IND",1,null,0,"IND",1,"IND",1,"IND",1,"IND",1,"IND",1,"IND",1,"IND",1,"IND",1,"NE",0,"IND",1,"IND",1,"IND",1,"IND",1,"IND",1,"IND",1,null,0,"IND",1,"IND",1,"IND",1,"IND",1,"IND",1,"IND",1,"IND",1,"IND",1,"NE",0,"IND",1,"NE",0,"IND",1,"IND",1,"IND",1,"IND",1,null,0,"IND",1,null,0,"IND",1,"IND",1,"IND",1,"IND",1,null,0,null,0,null,0,null,0,null,0,null,0,null,0,null,0,null,0,null,0,null,0,null,null,"",35]
["SEA","X","NYJ",null,"SEA",1,"SEA",1,"SEA",1,null,0,"SEA",1,"SEA",1,"SEA",1,"NYJ",0,"NYJ",0,"SEA",1,"SEA",1,"SEA",1,"SEA",1,"SEA",1,"SEA",1,"SEA",1,"SEA",1,"SEA",1,"SEA",1,null,0,"SEA",1,"SEA",1,"SEA",1,"SEA",1,"SEA",1,"SEA",1,"NYJ",0,"SEA",1,"NYJ",0,"SEA",1,"SEA",1,"SEA",1,"SEA",1,"SEA",1,"SEA",1,null,0,"SEA",1,null,0,"SEA",1,"NYJ",0,"SEA",1,"SEA",1,null,0,null,0,null,0,null,0,null,0,null,0,null,0,null,0,null,0,null,0,null,0,null,null,"",33]
["TEN",null,"WAS","X","TEN",0,"WAS",1,"WAS",1,null,0,"WAS",1,"TEN",0,"WAS",1,"WAS",1,"WAS",1,"WAS",1,"WAS",1,"WAS",1,"WAS",1,"WAS",1,"WAS",1,"WAS",1,"WAS",1,"WAS",1,"WAS",1,null,0,"WAS",1,"WAS",1,"WAS",1,"TEN",0,"WAS",1,"WAS",1,"WAS",1,"WAS",1,"WAS",1,"WAS",1,"WAS",1,"WAS",1,"WAS",1,"WAS",1,"WAS",1,null,0,"WAS",1,null,0,"WAS",1,"WAS",1,"WAS",1,"WAS",1,null,0,null,0,null,0,null,0,null,0,null,0,null,0,null,0,null,0,null,0,null,0,null,null,"",35]
["HOU","X","JAX",null,"HOU",{"$f":"IF($B21=\"X\",IF(E21=$A21,1,0),IF(E21=$C21,IF($D21=\"X\",1,0),0))","v":1},"HOU",{"$f":"IF($B21=\"X\",IF(G21=$A21,1,0),IF(G21=$C21,IF($D21=\"X\",1,0),0))","v":1},"HOU",{"$f":"IF($B21=\"X\",IF(I21=$A21,1,0),IF(I21=$C21,IF($D21=\"X\",1,0),0))","v":1},null,{"$f":"IF($B21=\"X\",IF(K21=$A21,1,0),IF(K21=$C21,IF($D21=\"X\",1,0),0))","v":0},"HOU",{"$f":"IF($B21=\"X\",IF(M21=$A21,1,0),IF(M21=$C21,IF($D21=\"X\",1,0),0))","v":1},"HOU",{"$f":"IF($B21=\"X\",IF(O21=$A21,1,0),IF(O21=$C21,IF($D21=\"X\",1,0),0))","v":1},"HOU",{"$f":"IF($B21=\"X\",IF(Q21=$A21,1,0),IF(Q21=$C21,IF($D21=\"X\",1,0),0))","v":1},"JAX",{"$f":"IF($B21=\"X\",IF(S21=$A21,1,0),IF(S21=$C21,IF($D21=\"X\",1,0),0))","v":0},"HOU",{"$f":"IF($B21=\"X\",IF(U21=$A21,1,0),IF(U21=$C21,IF($D21=\"X\",1,0),0))","v":1},"HOU",{"$f":"IF($B21=\"X\",IF(W21=$A21,1,0),IF(W21=$C21,IF($D21=\"X\",1,0),0))","v":1},"HOU",{"$f":"IF($B21=\"X\",IF(Y21=$A21,1,0),IF(Y21=$C21,IF($D21=\"X\",1,0),0))","v":1},"HOU",1,"HOU",1,"HOU",1,"HOU",1,"HOU",1,"HOU",1,"HOU",1,"HOU",1,null,0,"HOU",1,"HOU",1,"HOU",1,"HOU",1,"HOU",1,"HOU",1,"HOU",1,"HOU",1,"HOU",1,"HOU",1,"HOU",1,"HOU",1,"HOU",1,"HOU",1,"HOU",1,null,0,"HOU",1,null,0,"HOU",1,"HOU",1,"HOU",1,"HOU",1,null,0,null,0,null,0,null,0,null,0,null,0,null,0,null,0,null,0,null,0,null,0,null,null,{"$f":"IF(DJ21=$Y$5,\"*\",IF(DJ21=0,\"*\",\"\"))","v":""},{"$f":"SUM(E21:DF21)","v":37}]
["LAR","X","NO",null,"LAR",{"$f":"IF($B22=\"X\",IF(E22=$A22,1,0),IF(E22=$C22,IF($D22=\"X\",1,0),0))","v":1},"NO",{"$f":"IF($B22=\"X\",IF(G22=$A22,1,0),IF(G22=$C22,IF($D22=\"X\",1,0),0))","v":0},"NO",{"$f":"IF($B22=\"X\",IF(I22=$A22,1,0),IF(I22=$C22,IF($D22=\"X\",1,0),0))","v":0},null,{"$f":"IF($B22=\"X\",IF(K22=$A22,1,0),IF(K22=$C22,IF($D22=\"X\",1,0),0))","v":0},"NO",{"$f":"IF($B22=\"X\",IF(M22=$A22,1,0),IF(M22=$C22,IF($D22=\"X\",1,0),0))","v":0},"LAR",{"$f":"IF($B22=\"X\",IF(O22=$A22,1,0),IF(O22=$C22,IF($D22=\"X\",1,0),0))","v":1},"LAR",{"$f":"IF($B22=\"X\",IF(Q22=$A22,1,0),IF(Q22=$C22,IF($D22=\"X\",1,0),0))","v":1},"LAR",{"$f":"IF($B22=\"X\",IF(S22=$A22,1,0),IF(S22=$C22,IF($D22=\"X\",1,0),0))","v":1},"NO",{"$f":"IF($B22=\"X\",IF(U22=$A22,1,0),IF(U22=$C22,IF($D22=\"X\",1,0),0))","v":0},"LAR",{"$f":"IF($B22=\"X\",IF(W22=$A22,1,0),IF(W22=$C22,IF($D22=\"X\",1,0),0))","v":1},"LAR",{"$f":"IF($B22=\"X\",IF(Y22=$A22,1,0),IF(Y22=$C22,IF($D22=\"X\",1,0),0))","v":1},"NO",0,"NO",0,"LAR",1,"LAR",1,"LAR",1,"LAR",1,"LAR",1,"LAR",1,null,0,"LAR",1,"LAR",1,"LAR",1,"LAR",1,"LAR",1,"LAR",1,"NO",0,"LAR",1,"LAR",1,"LAR",1,"LAR",1,"LAR",1,"NO",0,"LAR",1,"LAR",1,null,0,"LAR",1,null,0,"NO",0,"LAR",1,"LAR",1,"LAR",1,null,0,null,0,null,0,null,0,null,0,null,0,null,0,null,0,null,0,null,0,null,0,null,null,{"$f":"IF(DJ22=$Y$5,\"*\",IF(DJ22=0,\"*\",\"\"))","v":""},{"$f":"SUM(E22:DF22)","v":29}]
["TB","X","CAR",null,"TB",1,"TB",1,"TB",1,null,0,"TB",1,"CAR",0,"TB",1,"TB",1,"TB",1,"TB",1,"TB",1,"TB",1,"TB",1,"TB",1,"TB",1,"TB",1,"TB",1,"TB",1,"TB",1,null,0,"TB",1,"TB",1,"TB",1,"CAR",0,"TB",1,"TB",1,"TB",1,"TB",1,"TB",1,"TB",1,"TB",1,"TB",1,"TB",1,"TB",1,"TB",1,null,0,"TB",1,null,0,"TB",1,"TB",1,"TB",1,"TB",1,null,0,null,0,null,0,null,0,null,0,null,0,null,0,null,0,null,0,null,0,null,0,null,null,"",36]
["PHI","X","BAL",null,"BAL",0,"BAL",0,"PHI",1,null,0,"BAL",0,"BAL",0,"BAL",0,"PHI",1,"BAL",0,"BAL",0,"PHI",1,"PHI",1,"BAL",0,"BAL",0,"BAL",0,"PHI",1,"PHI",1,"BAL",0,"BAL",0,null,0,"BAL",0,"PHI",1,"PHI",1,"PHI",1,"PHI",1,"PHI",1,"BAL",0,"BAL",0,"BAL",0,"PHI",1,"BAL",0,"BAL",0,"BAL",0,"PHI",1,"BAL",0,null,0,"PHI",1,null,0,"PHI",1,"BAL",0,"BAL",0,"BAL",0,null,0,null,0,null,0,null,0,null,0,null,0,null,0,null,0,null,0,null,0,null,0,null,null,"",{"$f":"SUM(E24:DF24)","v":15}]
["Sunday Night Game"]
["SF",null,"BUF","X","BUF",{"$f":"IF($B26=\"X\",IF(E26=$A26,1,0),IF(E26=$C26,IF($D26=\"X\",1,0),0))","v":1},"BUF",{"$f":"IF($B26=\"X\",IF(G26=$A26,1,0),IF(G26=$C26,IF($D26=\"X\",1,0),0))","v":1},"BUF",{"$f":"IF($B26=\"X\",IF(I26=$A26,1,0),IF(I26=$C26,IF($D26=\"X\",1,0),0))","v":1},null,{"$f":"IF($B26=\"X\",IF(K26=$A26,1,0),IF(K26=$C26,IF($D26=\"X\",1,0),0))","v":0},"BUF",{"$f":"IF($B26=\"X\",IF(M26=$A26,1,0),IF(M26=$C26,IF($D26=\"X\",1,0),0))","v":1},"BUF",{"$f":"IF($B26=\"X\",IF(O26=$A26,1,0),IF(O26=$C26,IF($D26=\"X\",1,0),0))","v":1},"BUF",{"$f":"IF($B26=\"X\",IF(Q26=$A26,1,0),IF(Q26=$C26,IF($D26=\"X\",1,0),0))","v":1},"BUF",{"$f":"IF($B26=\"X\",IF(S26=$A26,1,0),IF(S26=$C26,IF($D26=\"X\",1,0),0))","v":1},"BUF",{"$f":"IF($B26=\"X\",IF(U26=$A26,1,0),IF(U26=$C26,IF($D26=\"X\",1,0),0))","v":1},"BUF",{"$f":"IF($B26=\"X\",IF(W26=$A26,1,0),IF(W26=$C26,IF($D26=\"X\",1,0),0))","v":1},"BUF",{"$f":"IF($B26=\"X\",IF(Y26=$A26,1,0),IF(Y26=$C26,IF($D26=\"X\",1,0),0))","v":1},"BUF",{"$f":"IF($B26=\"X\",IF(AA26=$A26,1,0),IF(AA26=$C26,IF($D26=\"X\",1,0),0))","v":1},"BUF",{"$f":"IF($B26=\"X\",IF(AC26=$A26,1,0),IF(AC26=$C26,IF($D26=\"X\",1,0),0))","v":1},"BUF",{"$f":"IF($B26=\"X\",IF(AE26=$A26,1,0),IF(AE26=$C26,IF($D26=\"X\",1,0),0))","v":1},"BUF",{"$f":"IF($B26=\"X\",IF(AG26=$A26,1,0),IF(AG26=$C26,IF($D26=\"X\",1,0),0))","v":1},"BUF",{"$f":"IF($B26=\"X\",IF(AI26=$A26,1,0),IF(AI26=$C26,IF($D26=\"X\",1,0),0))","v":1},"BUF",{"$f":"IF($B26=\"X\",IF(AK26=$A26,1,0),IF(AK26=$C26,IF($D26=\"X\",1,0),0))","v":1},"BUF",{"$f":"IF($B26=\"X\",IF(AM26=$A26,1,0),IF(AM26=$C26,IF($D26=\"X\",1,0),0))","v":1},"BUF",{"$f":"IF($B26=\"X\",IF(AO26=$A26,1,0),IF(AO26=$C26,IF($D26=\"X\",1,0),0))","v":1},null,{"$f":"IF($B26=\"X\",IF(AQ26=$A26,1,0),IF(AQ26=$C26,IF($D26=\"X\",1,0),0))","v":0},"BUF",{"$f":"IF($B26=\"X\",IF(AS26=$A26,1,0),IF(AS26=$C26,IF($D26=\"X\",1,0),0))","v":1},"BUF",{"$f":"IF($B26=\"X\",IF(AU26=$A26,1,0),IF(AU26=$C26,IF($D26=\"X\",1,0),0))","v":1},"BUF",{"$f":"IF($B26=\"X\",IF(AW26=$A26,1,0),IF(AW26=$C26,IF($D26=\"X\",1,0),0))","v":1},"BUF",{"$f":"IF($B26=\"X\",IF(AY26=$A26,1,0),IF(AY26=$C26,IF($D26=\"X\",1,0),0))","v":1},"BUF",{"$f":"IF($B26=\"X\",IF(BA26=$A26,1,0),IF(BA26=$C26,IF($D26=\"X\",1,0),0))","v":1},"BUF",{"$f":"IF($B26=\"X\",IF(BC26=$A26,1,0),IF(BC26=$C26,IF($D26=\"X\",1,0),0))","v":1},"BUF",{"$f":"IF($B26=\"X\",IF(BE26=$A26,1,0),IF(BE26=$C26,IF($D26=\"X\",1,0),0))","v":1},"BUF",{"$f":"IF($B26=\"X\",IF(BG26=$A26,1,0),IF(BG26=$C26,IF($D26=\"X\",1,0),0))","v":1},"BUF",{"$f":"IF($B26=\"X\",IF(BI26=$A26,1,0),IF(BI26=$C26,IF($D26=\"X\",1,0),0))","v":1},"BUF",{"$f":"IF($B26=\"X\",IF(BK26=$A26,1,0),IF(BK26=$C26,IF($D26=\"X\",1,0),0))","v":1},"BUF",{"$f":"IF($B26=\"X\",IF(BM26=$A26,1,0),IF(BM26=$C26,IF($D26=\"X\",1,0),0))","v":1},"BUF",{"$f":"IF($B26=\"X\",IF(BO26=$A26,1,0),IF(BO26=$C26,IF($D26=\"X\",1,0),0))","v":1},"BUF",{"$f":"IF($B26=\"X\",IF(BQ26=$A26,1,0),IF(BQ26=$C26,IF($D26=\"X\",1,0),0))","v":1},"BUF",{"$f":"IF($B26=\"X\",IF(BS26=$A26,1,0),IF(BS26=$C26,IF($D26=\"X\",1,0),0))","v":1},"BUF",{"$f":"IF($B26=\"X\",IF(BU26=$A26,1,0),IF(BU26=$C26,IF($D26=\"X\",1,0),0))","v":1},null,{"$f":"IF($B26=\"X\",IF(BW26=$A26,1,0),IF(BW26=$C26,IF($D26=\"X\",1,0),0))","v":0},"BUF",{"$f":"IF($B26=\"X\",IF(BY26=$A26,1,0),IF(BY26=$C26,IF($D26=\"X\",1,0),0))","v":1},null,{"$f":"IF($B26=\"X\",IF(CA26=$A26,1,0),IF(CA26=$C26,IF($D26=\"X\",1,0),0))","v":0},"BUF",{"$f":"IF($B26=\"X\",IF(CC26=$A26,1,0),IF(CC26=$C26,IF($D26=\"X\",1,0),0))","v":1},"BUF",{"$f":"IF($B26=\"X\",IF(CE26=$A26,1,0),IF(CE26=$C26,IF($D26=\"X\",1,0),0))","v":1},"BUF",{"$f":"IF($B26=\"X\",IF(CG26=$A26,1,0),IF(CG26=$C26,IF($D26=\"X\",1,0),0))","v":1},"BUF",{"$f":"IF($B26=\"X\",IF(CI26=$A26,1,0),IF(CI26=$C26,IF($D26=\"X\",1,0),0))","v":1},null,{"$f":"IF($B26=\"X\",IF(CK26=$A26,1,0),IF(CK26=$C26,IF($D26=\"X\",1,0),0))","v":0},null,{"$f":"IF($B26=\"X\",IF(CM26=$A26,1,0),IF(CM26=$C26,IF($D26=\"X\",1,0),0))","v":0},null,{"$f":"IF($B26=\"X\",IF(CO26=$A26,1,0),IF(CO26=$C26,IF($D26=\"X\",1,0),0))","v":0},null,{"$f":"IF($B26=\"X\",IF(CQ26=$A26,1,0),IF(CQ26=$C26,IF($D26=\"X\",1,0),0))","v":0},null,{"$f":"IF($B26=\"X\",IF(CS26=$A26,1,0),IF(CS26=$C26,IF($D26=\"X\",1,0),0))","v":0},null,{"$f":"IF($B26=\"X\",IF(CU26=$A26,1,0),IF(CU26=$C26,IF($D26=\"X\",1,0),0))","v":0},null,{"$f":"IF($B26=\"X\",IF(CW26=$A26,1,0),IF(CW26=$C26,IF($D26=\"X\",1,0),0))","v":0},null,{"$f":"IF($B26=\"X\",IF(CY26=$A26,1,0),IF(CY26=$C26,IF($D26=\"X\",1,0),0))","v":0},null,{"$f":"IF($B26=\"X\",IF(DA26=$A26,1,0),IF(DA26=$C26,IF($D26=\"X\",1,0),0))","v":0},null,{"$f":"IF($B26=\"X\",IF(DC26=$A26,1,0),IF(DC26=$C26,IF($D26=\"X\",1,0),0))","v":0},null,{"$f":"IF($B26=\"X\",IF(DE26=$A26,1,0),IF(DE26=$C26,IF($D26=\"X\",1,0),0))","v":0},null,null,{"$f":"IF(DJ26=$Y$5,\"*\",IF(DJ26=0,\"*\",\"\"))","v":"*"},{"$f":"SUM(E26:DF26)","v":38}]
["Monday Night Game"]
["CLE",null,"DEN","X","DEN",{"$f":"IF($B28=\"X\",IF(E28=$A28,1,0),IF(E28=$C28,IF($D28=\"X\",1,0),0))","v":1},"DEN",{"$f":"IF($B28=\"X\",IF(G28=$A28,1,0),IF(G28=$C28,IF($D28=\"X\",1,0),0))","v":1},"DEN",{"$f":"IF($B28=\"X\",IF(I28=$A28,1,0),IF(I28=$C28,IF($D28=\"X\",1,0),0))","v":1},null,{"$f":"IF($B28=\"X\",IF(K28=$A28,1,0),IF(K28=$C28,IF($D28=\"X\",1,0),0))","v":0},"DEN",{"$f":"IF($B28=\"X\",IF(M28=$A28,1,0),IF(M28=$C28,IF($D28=\"X\",1,0),0))","v":1},"DEN",{"$f":"IF($B28=\"X\",IF(O28=$A28,1,0),IF(O28=$C28,IF($D28=\"X\",1,0),0))","v":1},"CLE",{"$f":"IF($B28=\"X\",IF(Q28=$A28,1,0),IF(Q28=$C28,IF($D28=\"X\",1,0),0))","v":0},"DEN",{"$f":"IF($B28=\"X\",IF(S28=$A28,1,0),IF(S28=$C28,IF($D28=\"X\",1,0),0))","v":1},"DEN",{"$f":"IF($B28=\"X\",IF(U28=$A28,1,0),IF(U28=$C28,IF($D28=\"X\",1,0),0))","v":1},"CLE",{"$f":"IF($B28=\"X\",IF(W28=$A28,1,0),IF(W28=$C28,IF($D28=\"X\",1,0),0))","v":0},"DEN",{"$f":"IF($B28=\"X\",IF(Y28=$A28,1,0),IF(Y28=$C28,IF($D28=\"X\",1,0),0))","v":1},"DEN",{"$f":"IF($B28=\"X\",IF(AA28=$A28,1,0),IF(AA28=$C28,IF($D28=\"X\",1,0),0))","v":1},"DEN",{"$f":"IF($B28=\"X\",IF(AC28=$A28,1,0),IF(AC28=$C28,IF($D28=\"X\",1,0),0))","v":1},"DEN",{"$f":"IF($B28=\"X\",IF(AE28=$A28,1,0),IF(AE28=$C28,IF($D28=\"X\",1,0),0))","v":1},"DEN",{"$f":"IF($B28=\"X\",IF(AG28=$A28,1,0),IF(AG28=$C28,IF($D28=\"X\",1,0),0))","v":1},"DEN",{"$f":"IF($B28=\"X\",IF(AI28=$A28,1,0),IF(AI28=$C28,IF($D28=\"X\",1,0),0))","v":1},"DEN",{"$f":"IF($B28=\"X\",IF(AK28=$A28,1,0),IF(AK28=$C28,IF($D28=\"X\",1,0),0))","v":1},"DEN",{"$f":"IF($B28=\"X\",IF(AM28=$A28,1,0),IF(AM28=$C28,IF($D28=\"X\",1,0),0))","v":1},"DEN",{"$f":"IF($B28=\"X\",IF(AO28=$A28,1,0),IF(AO28=$C28,IF($D28=\"X\",1,0),0))","v":1},null,{"$f":"IF($B28=\"X\",IF(AQ28=$A28,1,0),IF(AQ28=$C28,IF($D28=\"X\",1,0),0))","v":0},"DEN",{"$f":"IF($B28=\"X\",IF(AS28=$A28,1,0),IF(AS28=$C28,IF($D28=\"X\",1,0),0))","v":1},"CLE",{"$f":"IF($B28=\"X\",IF(AU28=$A28,1,0),IF(AU28=$C28,IF($D28=\"X\",1,0),0))","v":0},"DEN",{"$f":"IF($B28=\"X\",IF(AW28=$A28,1,0),IF(AW28=$C28,IF($D28=\"X\",1,0),0))","v":1},"DEN",{"$f":"IF($B28=\"X\",IF(AY28=$A28,1,0),IF(AY28=$C28,IF($D28=\"X\",1,0),0))","v":1},"CLE",{"$f":"IF($B28=\"X\",IF(BA28=$A28,1,0),IF(BA28=$C28,IF($D28=\"X\",1,0),0))","v":0},"DEN",{"$f":"IF($B28=\"X\",IF(BC28=$A28,1,0),IF(BC28=$C28,IF($D28=\"X\",1,0),0))","v":1},"DEN",{"$f":"IF($B28=\"X\",IF(BE28=$A28,1,0),IF(BE28=$C28,IF($D28=\"X\",1,0),0))","v":1},"DEN",{"$f":"IF($B28=\"X\",IF(BG28=$A28,1,0),IF(BG28=$C28,IF($D28=\"X\",1,0),0))","v":1},"DEN",{"$f":"IF($B28=\"X\",IF(BI28=$A28,1,0),IF(BI28=$C28,IF($D28=\"X\",1,0),0))","v":1},"DEN",{"$f":"IF($B28=\"X\",IF(BK28=$A28,1,0),IF(BK28=$C28,IF($D28=\"X\",1,0),0))","v":1},"DEN",{"$f":"IF($B28=\"X\",IF(BM28=$A28,1,0),IF(BM28=$C28,IF($D28=\"X\",1,0),0))","v":1},"DEN",{"$f":"IF($B28=\"X\",IF(BO28=$A28,1,0),IF(BO28=$C28,IF($D28=\"X\",1,0),0))","v":1},"CLE",{"$f":"IF($B28=\"X\",IF(BQ28=$A28,1,0),IF(BQ28=$C28,IF($D28=\"X\",1,0),0))","v":0},"DEN",{"$f":"IF($B28=\"X\",IF(BS28=$A28,1,0),IF(BS28=$C28,IF($D28=\"X\",1,0),0))","v":1},"DEN",{"$f":"IF($B28=\"X\",IF(BU28=$A28,1,0),IF(BU28=$C28,IF($D28=\"X\",1,0),0))","v":1},null,{"$f":"IF($B28=\"X\",IF(BW28=$A28,1,0),IF(BW28=$C28,IF($D28=\"X\",1,0),0))","v":0},"DEN",{"$f":"IF($B28=\"X\",IF(BY28=$A28,1,0),IF(BY28=$C28,IF($D28=\"X\",1,0),0))","v":1},null,{"$f":"IF($B28=\"X\",IF(CA28=$A28,1,0),IF(CA28=$C28,IF($D28=\"X\",1,0),0))","v":0},"DEN",{"$f":"IF($B28=\"X\",IF(CC28=$A28,1,0),IF(CC28=$C28,IF($D28=\"X\",1,0),0))","v":1},"DEN",{"$f":"IF($B28=\"X\",IF(CE28=$A28,1,0),IF(CE28=$C28,IF($D28=\"X\",1,0),0))","v":1},"DEN",{"$f":"IF($B28=\"X\",IF(CG28=$A28,1,0),IF(CG28=$C28,IF($D28=\"X\",1,0),0))","v":1},"DEN",{"$f":"IF($B28=\"X\",IF(CI28=$A28,1,0),IF(CI28=$C28,IF($D28=\"X\",1,0),0))","v":1},null,{"$f":"IF($B28=\"X\",IF(CK28=$A28,1,0),IF(CK28=$C28,IF($D28=\"X\",1,0),0))","v":0},null,{"$f":"IF($B28=\"X\",IF(CM28=$A28,1,0),IF(CM28=$C28,IF($D28=\"X\",1,0),0))","v":0},null,{"$f":"IF($B28=\"X\",IF(CO28=$A28,1,0),IF(CO28=$C28,IF($D28=\"X\",1,0),0))","v":0},null,{"$f":"IF($B28=\"X\",IF(CQ28=$A28,1,0),IF(CQ28=$C28,IF($D28=\"X\",1,0),0))","v":0},null,{"$f":"IF($B28=\"X\",IF(CS28=$A28,1,0),IF(CS28=$C28,IF($D28=\"X\",1,0),0))","v":0},null,{"$f":"IF($B28=\"X\",IF(CU28=$A28,1,0),IF(CU28=$C28,IF($D28=\"X\",1,0),0))","v":0},null,{"$f":"IF($B28=\"X\",IF(CW28=$A28,1,0),IF(CW28=$C28,IF($D28=\"X\",1,0),0))","v":0},null,{"$f":"IF($B28=\"X\",IF(CY28=$A28,1,0),IF(CY28=$C28,IF($D28=\"X\",1,0),0))","v":0},null,{"$f":"IF($B28=\"X\",IF(DA28=$A28,1,0),IF(DA28=$C28,IF($D28=\"X\",1,0),0))","v":0},null,{"$f":"IF($B28=\"X\",IF(DC28=$A28,1,0),IF(DC28=$C28,IF($D28=\"X\",1,0),0))","v":0},null,{"$f":"IF($B28=\"X\",IF(DE28=$A28,1,0),IF(DE28=$C28,IF($D28=\"X\",1,0),0))","v":0},null,null,{"$f":"IF(DJ28=$Y$5,\"*\",IF(DJ28=0,\"*\",\"\"))","v":""},{"$f":"SUM(E28:DF28)","v":33}]
["Actual Sun. Total Score  ->",null,null,45]
["Actual Mon. Total Score ->",null,null,73,"TOTAL",{"$f":"SUM(F9:F29)","v":13},"TOTAL",{"$f":"SUM(H9:H29)","v":13},"TOTAL",{"$f":"SUM(J9:J29)","v":14},"TOTAL",{"$f":"SUM(L9:L29)","v":0},"TOTAL",{"$f":"SUM(N9:N29)","v":11},"TOTAL",{"$f":"SUM(P9:P29)","v":12},"TOTAL",{"$f":"SUM(R9:R29)","v":13},"TOTAL",{"$f":"SUM(T9:T29)","v":13},"TOTAL",{"$f":"SUM(V9:V29)","v":13},"TOTAL",{"$f":"SUM(X9:X29)","v":12},"TOTAL",{"$f":"SUM(Z9:Z29)","v":14},"TOTAL",{"$f":"SUM(AB9:AB29)","v":12},"TOTAL",{"$f":"SUM(AD9:AD29)","v":12},"TOTAL",{"$f":"SUM(AF9:AF29)","v":14},"TOTAL",{"$f":"SUM(AH9:AH29)","v":15},"TOTAL",{"$f":"SUM(AJ9:AJ29)","v":15},"TOTAL",{"$f":"SUM(AL9:AL29)","v":16},"TOTAL",{"$f":"SUM(AN9:AN29)","v":15},"TOTAL",{"$f":"SUM(AP9:AP29)","v":13},"TOTAL",{"$f":"SUM(AR9:AR29)","v":0},"TOTAL",{"$f":"SUM(AT9:AT29)","v":13},"TOTAL",{"$f":"SUM(AV9:AV29)","v":14},"TOTAL",{"$f":"SUM(AX9:AX29)","v":14},"TOTAL",{"$f":"SUM(AZ9:AZ29)","v":10},"TOTAL",{"$f":"SUM(BB9:BB29)","v":13},"TOTAL",{"$f":"SUM(BD9:BD29)","v":15},"TOTAL",{"$f":"SUM(BF9:BF29)","v":13},"TOTAL",{"$f":"SUM(BH9:BH29)","v":14},"TOTAL",{"$f":"SUM(BJ9:BJ29)","v":11},"TOTAL",{"$f":"SUM(BL9:BL29)","v":16},"TOTAL",{"$f":"SUM(BN9:BN29)","v":12},"TOTAL",{"$f":"SUM(BP9:BP29)","v":14},"TOTAL",{"$f":"SUM(BR9:BR29)","v":12},"TOTAL",{"$f":"SUM(BT9:BT29)","v":16},"TOTAL",{"$f":"SUM(BV9:BV29)","v":14},"TOTAL",{"$f":"SUM(BX9:BX29)","v":0},"TOTAL",{"$f":"SUM(BZ9:BZ29)","v":14},"TOTAL",{"$f":"SUM(CB9:CB29)","v":0},"TOTAL",{"$f":"SUM(CD9:CD29)","v":15},"TOTAL",{"$f":"SUM(CF9:CF29)","v":12},"TOTAL",{"$f":"SUM(CH9:CH29)","v":14},"TOTAL",{"$f":"SUM(CJ9:CJ29)","v":15},"TOTAL",{"$f":"SUM(CL9:CL29)","v":0},"TOTAL",{"$f":"SUM(CN9:CN29)","v":0},"TOTAL",{"$f":"SUM(CP9:CP29)","v":0},"TOTAL",{"$f":"SUM(CR9:CR29)","v":0},"TOTAL",{"$f":"SUM(CT9:CT29)","v":0},"TOTAL",{"$f":"SUM(CV9:CV29)","v":0},"TOTAL",{"$f":"SUM(CX9:CX29)","v":0},"TOTAL",{"$f":"SUM(CZ9:CZ29)","v":0},"TOTAL",{"$f":"SUM(DB9:DB29)","v":0},"TOTAL",{"$f":"SUM(DD9:DD29)","v":0},"TOTAL",{"$f":"SUM(DF9:DF29)","v":0}]
["Sun. Night Total Score Entry >",null,null,null,47,null,42,null,45,null,null,null,44,null,44,null,31,null,45,null,45,null,45,null,48,null,31,null,44,null,52,null,44,null,48,null,44,null,45,null,45,null,null,null,44,null,50,null,49,null,48,null,38,null,45,null,38,null,44,null,46,null,40,null,55,null,44,null,39,null,43,null,42,null,null,null,51,null,null,null,47,null,45,null,62,null,45]
["Mon. Night Total Score Entry >",null,null,null,38,null,38,null,39,null,null,null,45,null,42,null,38,null,43,null,42,null,42,null,45,null,31,null,42,null,45,null,42,null,39,null,42,null,40,null,42,null,null,null,41,null,40,null,42,null,22,null,24,null,38,null,38,null,42,null,38,null,44,null,40,null,45,null,39,null,43,null,44,null,null,null,43,null,null,null,42,null,45,null,51,null,43]
[null,"Wins","Sun. Score",null,"Mon. Score",null,null,null,null,null,null,null,null,null,null,null,null,null,null,null,""]
[null,null,"Total"]
["KCIV",16,44,null,42]
["Ryan M",16,43,null,43,"2nd"]
["Peter S",16,40,null,44,"1st"]
["Lynne",15,45,null,38]
["Julie",15,48,null,39]
["Keith M",15,45,null,40]
["Jan",15,44,null,42]
["Triple B's",15,47,null,42]
["Wayne K2",15,45,null,43]
["Bake",14,45,null,39]
["Lee",14,50,null,40]
["Miss Chris",14,44,null,42]
["Lucky Lady",14,49,null,42]
["Sky King",14,51,null,43]
["Saxman",14,42,null,44]
["Posh",14,44,null,45]
["Clevelander2",14,48,null,45]
["Hudie",14,52,null,45]
["Wayne K1",14,62,null,51]
["LoveyD",13,38,null,24]
["Chris C",13,31,null,38,null,null,null,null,null,null,null,null,null,"[ return home ]"]
["Mike K",13,38,null,38]
["Andy B",13,42,null,38]
["Aaron S",13,47,null,38]
["Lisa",13,44,null,41]
["Chuck L",13,45,null,42]
["Kevin L",13,45,null,42]
["Chris M",13,45,null,43]
["Dave H",12,31,null,31]
["Ralph",12,39,null,39]
["Pickled",12,55,null,40]
["Casey",12,44,null,42]
["Dsok",12,44,null,42]
["Clevelander1",12,45,null,42]
["Wayne D",12,45,null,45]
["Pat",11,46,null,38]
["Carol",11,44,null,45]
["Lord Nulsen",10,48,null,22]
["Brandon",0]
["Kristin",0]
["Shoes",0]
["Snake",0]
[null,0]
[null,0]
[null,0]
[null,0]
[null,0]
[null,0]
[null,0]
[null,0]
[null,0]
[null,0]
[null,0]
[]
[]
[]
[]
[]
[]
[]
[]
[]
[]
[]
[]
[]
[]
[]
[]
[]
[]
[]
[]
[]
[]
[]
[]
[]
[]
[]
[]
[]
[]
[]
[]
[]
[]
[]
[]
[]
[]
[]
[]
[]
[]
[]
[]
[]
[]
[]
[]
[]
[]
[]
[]
[""]

{"sheet":"Sheet2","index":1,"n_rows":135,"n_cols":256,"rows_kept":135,"cut":false,"hidden":false,"merged":[[18,0,18,1],[18,2,18,3],[12,0,12,3],[14,0,14,3],[17,0,17,1],[17,2,17,3]]}
[null,"TEN","CLE","X",null,null,{"$f":"TRIM(IF(D1=\"x\",C1,IF(A1=\"x\",B1,\"\")))","v":"CLE"},1,null,{"$f":"TRIM(A1)","v":""},{"$f":"TRIM(D1)","v":"X"}]
["X","BAL","MIA",null,null,null,{"$f":"TRIM(IF(D2=\"x\",C2,IF(A2=\"x\",B2,\"\")))","v":"BAL"},1,null,{"$f":"TRIM(A2)","v":"X"},{"$f":"TRIM(D2)","v":""}]
[null,"ATL","MIN","X",null,null,{"$f":"TRIM(IF(D3=\"x\",C3,IF(A3=\"x\",B3,\"\")))","v":"MIN"},1,null,{"$f":"TRIM(A3)","v":""},{"$f":"TRIM(D3)","v":"X"}]
["X","BUF","NYJ",null,null,null,{"$f":"TRIM(IF(D4=\"x\",C4,IF(A4=\"x\",B4,\"\")))","v":"BUF"},1,null,{"$f":"TRIM(A4)","v":"X"},{"$f":"TRIM(D4)","v":""}]
[null,"WAS","PHI","X",null,null,"PHI",1,null,"","X"]
[null,"LAR","CAR","X",null,null,"CAR",1,null,"","X"]
["X","KC","JAX",null,null,null,"KC",1,null,"X",""]
[null,"IND","LAC","X",null,null,"LAC",1,null,"","X"]
[null,"CIN","SEA","X",null,null,"SEA",1,null,"","X"]
[null,"NYG","DAL","X",null,null,"DAL",1,null,"","X"]
["X","DET","AZ",null,null,null,"DET",1,null,"X",""]
["X","SF","TB",null,null,null,"SF",1,null,"X",""]
["SUNDAY NIGHT GAME",null,null,null,null,null,"",1,null,"SUNDAY NIGHT GAME",""]
[null,"PIT","NE","X",null,null,"NE",1,null,"","X"]
["MONDAY NIGHT GAME"]
[null,"HOU","NO","X",null,null,{"$f":"TRIM(IF(D16=\"x\",C16,IF(A16=\"x\",B16,\"\")))","v":"NO"},1,null,{"$f":"TRIM(A16)","v":""},{"$f":"TRIM(D16)","v":"X"}]
["X","DEN","OAK",null,null,null,{"$f":"TRIM(IF(D17=\"x\",C17,IF(A17=\"x\",B17,\"\")))","v":"DEN"}]
["Total Sunday Night Score                      à",null,41,null,null,null,{"$f":"TRIM(IF(D18=\"x\",C18,IF(A18=\"x\",B18,\"\")))","v":""},1,null,{"$f":"TRIM(A18)","v":"Total Sunday Night Score à"},{"$f":"TRIM(D18)","v":""}]
["Total Monday Night Score (DEN@OAK) à",null,30,null,null,null,{"$f":"TRIM(IF(D19=\"x\",C19,IF(A19=\"x\",B19,\"\")))","v":""},1,null,{"$f":"TRIM(A19)","v":"Total Monday Night Score (DEN@OAK) à"},{"$f":"TRIM(D19)","v":""}]
[null,null,null,null,null,null,"Total"]
["*:","DET","*:","DET","*:","DET","*:","DET",":","DET","*:","DET","*:","DET","*:","DET","*:","DET","*:","DET","*:","DET","*:","DET","*:","DET","*:","DET","*:","DET","*:","DET","*:","DET","*:","DET",":","DET","*:","DET","*:","DET","*:","DET","*:","DET","*:","DET","*:","DET","*:","DET","*:","DET","*:","DET","*:","DET","*:","DET","*:","DET","*:","DET","*:","DET","*:","DET","*:","DET","*:","DET","*:","DET","*:","DET","*:","BUF","*:","BUF","*:","BUF"]
["*:","DAL","*:","DAL","*:","DAL","*:","DAL","*:","DAL","*:","DAL","*:","DAL","*:","DAL","*:","DAL","*:","DAL","*:","DAL","*:","DAL","*:","DAL","*:","DAL","*:","DAL","*:","DAL","*:","DAL","*:","DAL","*:","DAL","*:","DAL","*:","DAL","*:","DAL","*:","DAL","*:","DAL","*:","DAL","*:","DAL","*:","DAL","*:","DAL","*:","DAL","*:","DAL","*:","DAL","*:","DAL","*:","DAL","*:","DAL","*:","DAL","*:","DAL","*:","DAL","*:","DAL","*:","NYG","*:","DAL","*:","DAL"]
["*:","MIA","*:","GB","*:","GB","*:","GB","*:","GB","*:","GB","*:","GB","*:","GB","*:","GB","*:","GB","*:","MIA","*:","GB","*:","GB","*:","GB","*:","GB","*:","GB","*:","GB","*:","GB","*:","GB","*:","GB","*:","MIA","*:","GB","*:","GB","*:","MIA","*:","MIA","*:","GB","*:","GB","*:","GB","*:","GB","*:","GB","*:","GB","*:","MIA","*:","MIA","*:","GB","*:","MIA","*:","GB","*:","GB","*:","GB","*:","MIN","*:","MIN","*:","NE"]
[":","Friday Game",":","Friday Game",":","Friday Game",":","Friday Game",":","Friday Game",":","Friday Game",":","Friday Game",":","Friday Game",":","Friday Game",":","Friday Game",":","Friday Game",":","Friday Game",":","Friday Game",":","Friday Game",":","Friday Game",":","Friday Game",":","Friday Game",":","Friday Game",":","Friday Game",":","Friday Game",":","Friday Game",":","Friday Game",":","Friday Game",":","Friday Game",":","Friday Game",":","Friday Game",":","Friday Game",":","Friday Game",":","Friday Game",":","Friday Game",":","Friday Game",":","Friday Game",":","Friday Game",":","Friday Game",":","Friday Game",":","Friday Game",":","Friday Game",":","Friday Game",":","Sunday Games",":","Sunday Games",":","Sunday Games",":","TB",":","TB","*:","TB","*:","SEA","*:","TB","*:","TB"]
["*:","KC","*:","KC","*:","KC","*:","KC","*:","KC","*:","KC","*:","KC","*:","KC","*:","KC","*:","KC","*:","KC","*:","KC","*:","KC","*:","KC","*:","KC","*:","KC","*:","KC","*:","KC","*:","KC","*:","KC","*:","KC","*:","KC","*:","KC","*:","KC","*:","KC","*:","KC","*:","KC","*:","KC","*:","KC","*:","KC","*:","KC","*:","KC","*:","KC","*:","KC","*:","KC","*:","KC","*:","KC","*:","KC","*:","TB","*:","TB","*:","TB","*:","MIN","*:","BUF","*:","BUF","*:","BUF","*:","BUF","*:","BUF"]
[":","Sunday Games",":","Sunday Games",":","Sunday Games",":","Sunday Games",":","Sunday Games",":","Sunday Games",":","Sunday Games",":","Sunday Games",":","Sunday Games",":","Sunday Games",":","Sunday Games",":","Sunday Games",":","Sunday Games",":","Sunday Games",":","Sunday Games",":","Sunday Games",":","Sunday Games",":","Sunday Games",":","Sunday Games",":","Sunday Games",":","Sunday Games",":","Sunday Games",":","Sunday Games",":","Sunday Games",":","Sunday Games",":","Sunday Games",":","Sunday Games",":","Sunday Games",":","Sunday Games",":","Sunday Games",":","Sunday Games",":","Sunday Games",":","Sunday Games",":","Sunday Games",":","Sunday Games",":","Sunday Games",":","Sunday Games",":","Sunday Games","*:","TEN","*:","TEN","*:","CIN","*:","CHI","*:","DET","*:","DET","*:","CHI","*:","DET","*:","CHI"]
["*:","ATL","*:","LAC","*:","LAC","*:","LAC","*:","LAC","*:","ATL","*:","LAC","*:","LAC","*:","ATL","*:","LAC","*:","LAC","*:","LAC","*:","ATL","*:","ATL","*:","LAC","*:","ATL","*:","LAC","*:","LAC","*:","LAC","*:","LAC","*:","LAC","*:","LAC","*:","ATL","*:","LAC","*:","ATL","*:","LAC","*:","ATL","*:","LAC","*:","LAC","*:","LAC","*:","LAC","*:","LAC","*:","LAC","*:","ATL","*:","ATL","*:","ATL","*:","ATL","*:","LAC","*:","MIA","*:","MIA","*:","MIA","*:","TEN","*:","TEN","*:","TEN","*:","TEN","*:","TEN","*:","TEN"]
["*:","CIN","*:","PIT","*:","PIT","*:","CIN","*:","PIT","*:","CIN","*:","PIT","*:","CIN","*:","CIN","*:","PIT","*:","PIT","*:","PIT","*:","PIT","*:","CIN","*:","CIN","*:","CIN","*:","CIN","*:","CIN","*:","PIT","*:","PIT","*:","CIN","*:","CIN","*:","CIN","*:","CIN","*:","CIN","*:","CIN","*:","CIN","*:","CIN","*:","CIN","*:","PIT","*:","PIT","*:","PIT","*:","PIT","*:","CIN","*:","PIT","*:","PIT","*:","PIT","*:","CIN","*:","CHI","*:","CHI","*:","NYJ","*:","KC","*:","KC","*:","KC","*:","KC","*:","KC","*:","KC"]
["*:","MIN","*:","AZ","*:","MIN","*:","MIN","*:","MIN","*:","MIN","*:","MIN","*:","MIN","*:","MIN","*:","MIN","*:","MIN","*:","MIN","*:","MIN","*:","MIN","*:","MIN","*:","MIN","*:","MIN","*:","MIN","*:","MIN","*:","MIN","*:","MIN","*:","MIN","*:","MIN","*:","AZ","*:","AZ","*:","MIN","*:","MIN","*:","AZ","*:","MIN","*:","MIN","*:","MIN","*:","MIN","*:","MIN","*:","MIN","*:","MIN","*:","MIN","*:","MIN","*:","MIN","*:","ATL","*:","WAS","*:","WAS","*:","MIA","*:","MIA","*:","MIA","*:","MIA","*:","MIA","*:","CLE"]
["*:","IND","*:","IND","*:","IND","*:","IND","*:","IND","*:","IND","*:","IND","*:","IND","*:","IND","*:","IND","*:","IND","*:","IND","*:","IND","*:","NE","*:","IND","*:","IND","*:","IND","*:","IND","*:","IND","*:","IND","*:","IND","*:","NE","*:","IND","*:","IND","*:","IND","*:","IND","*:","IND","*:","IND","*:","IND","*:","IND","*:","IND","*:","IND","*:","IND","*:","NE","*:","IND","*:","IND","*:","IND","*:","IND","*:","DEN","*:","DEN","*:","DEN","*:","NYG","*:","HOU","*:","HOU","*:","NYG","*:","NYG","*:","HOU"]
["*:","SEA","*:","SEA","*:","SEA","*:","SEA","*:","SEA","*:","NYJ","*:","NYJ","*:","SEA","*:","SEA","*:","SEA","*:","SEA","*:","NYJ","*:","SEA","*:","SEA","*:","SEA","*:","SEA","*:","SEA","*:","SEA","*:","SEA","*:","SEA","*:","SEA","*:","SEA","*:","SEA","*:","SEA","*:","SEA","*:","SEA","*:","SEA","*:","SEA","*:","SEA","*:","SEA","*:","SEA","*:","SEA","*:","SEA","*:","NYJ","*:","SEA","*:","NYJ","*:","SEA","*:","SEA","*:","BAL","*:","BAL","*:","BAL","*:","PIT","*:","PIT","*:","PIT","*:","PIT","*:","PIT","*:","NO"]
["*:","WAS","*:","WAS","*:","WAS","*:","WAS","*:","WAS","*:","WAS","*:","WAS","*:","WAS","*:","WAS","*:","WAS","*:","WAS","*:","WAS","*:","WAS","*:","WAS","*:","WAS","*:","WAS","*:","WAS","*:","TEN","*:","WAS","*:","WAS","*:","WAS","*:","WAS","*:","WAS","*:","WAS","*:","TEN","*:","TEN","*:","WAS","*:","WAS","*:","WAS","*:","WAS","*:","WAS","*:","WAS","*:","WAS","*:","WAS","*:","WAS","*:","WAS","*:","WAS","*:","WAS","*:","LAC","*:","LAC","*:","AZ","*:","LV","*:","LV","*:","LV","*:","LV","*:","LV","*:","IND"]
["*:","HOU","*:","HOU","*:","HOU","*:","HOU","*:","HOU","*:","HOU","*:","HOU","*:","HOU","*:","HOU","*:","HOU","*:","HOU","*:","HOU","*:","HOU","*:","HOU","*:","HOU","*:","HOU","*:","HOU","*:","HOU","*:","HOU","*:","HOU","*:","HOU","*:","HOU","*:","HOU","*:","HOU","*:","HOU","*:","HOU","*:","HOU","*:","HOU","*:","HOU","*:","HOU","*:","HOU","*:","HOU","*:","HOU","*:","HOU","*:","HOU","*:","JAX","*:","HOU","*:","HOU","*:","SEA","*:","SEA","*:","SEA","*:","DAL","*:","DAL","*:","DAL","*:","DAL","*:","GB","*:","GB"]
["*:","NO","*:","LAR","*:","LAR","*:","NO","*:","LAR","*:","LAR","*:","NO","*:","NO","*:","LAR","*:","LAR","*:","LAR","*:","NO","*:","LAR","*:","LAR","*:","LAR","*:","LAR","*:","LAR","*:","LAR","*:","LAR","*:","NO","*:","LAR","*:","NO","*:","LAR","*:","NO","*:","LAR","*:","LAR","*:","LAR","*:","LAR","*:","LAR","*:","LAR","*:","LAR","*:","LAR","*:","LAR","*:","LAR","*:","LAR","*:","LAR","*:","NO","*:","LAR","*:","KC","*:","KC","*:","KC","*:","LAR","*:","LAR","*:","LAR","*:","LAR","*:","AZ","*:","AZ"]
["*:","TB","*:","TB","*:","TB","*:","TB","*:","TB","*:","TB","*:","TB","*:","TB","*:","TB","*:","TB","*:","TB","*:","TB","*:","TB","*:","TB","*:","TB","*:","TB","*:","TB","*:","CAR","*:","TB","*:","TB","*:","TB","*:","TB","*:","TB","*:","TB","*:","CAR","*:","TB","*:","TB","*:","TB","*:","TB","*:","TB","*:","TB","*:","TB","*:","TB","*:","TB","*:","TB","*:","TB","*:","TB","*:","TB","*:","SF","*:","SF","*:","SF",":",null,":",null,":",null,":",null,":",null,":"]
["*:","PHI","*:","BAL","*:","BAL","*:","PHI","*:","PHI","*:","BAL","*:","BAL","*:","BAL","*:","PHI","*:","BAL","*:","PHI","*:","BAL","*:","PHI","*:","BAL","*:","PHI","*:","PHI","*:","BAL","*:","BAL","*:","PHI","*:","PHI","*:","BAL","*:","BAL","*:","BAL","*:","BAL","*:","PHI","*:","BAL","*:","BAL","*:","PHI","*:","BAL","*:","BAL","*:","PHI","*:","BAL","*:","BAL","*:","BAL","*:","PHI","*:","PHI","*:","BAL","*:","BAL",":","Sunday Night Game",":","Sunday Night Game",":","Sunday Night Game",":",null,":",null,":",null,":",null,":",null,":"]
[":","Sunday Night Game",":","Sunday Night Game",":","Sunday Night Game",":","Sunday Night Game",":","Sunday Night Game",":","Sunday Night Game",":","Sunday Night Game",":","Sunday Night Game",":","Sunday Night Game",":","Sunday Night Game",":","Sunday Night Game",":","Sunday Night Game",":","Sunday Night Game",":","Sunday Night Game",":","Sunday Night Game",":","Sunday Night Game",":","Sunday Night Game",":","Sunday Night Game",":","Sunday Night Game",":","Sunday Night Game",":","Sunday Night Game",":","Sunday Night Game",":","Sunday Night Game",":","Sunday Night Game",":","Sunday Night Game",":","Sunday Night Game",":","Sunday Night Game",":","Sunday Night Game",":","Sunday Night Game",":","Sunday Night Game",":","Sunday Night Game",":","Sunday Night Game",":","Sunday Night Game",":","Sunday Night Game",":","Sunday Night Game",":","Sunday Night Game",":","Sunday Night Game",":","Sunday Night Game","*:","PHI","*:","PHI","*:","PHI",":","Sunday Night Game",":","Sunday Night Game",":","Sunday Night Game",":","Sunday Night Game",":","Sunday Night Game",":","Sunday Night Game"]
["*:","BUF","*:","BUF","*:","BUF","*:","BUF","*:","BUF","*:","BUF","*:","BUF","*:","BUF","*:","BUF","*:","BUF","*:","BUF","*:","BUF","*:","BUF","*:","BUF","*:","BUF","*:","BUF","*:","BUF","*:","BUF","*:","BUF","*:","BUF","*:","BUF","*:","BUF","*:","BUF","*:","BUF","*:","BUF","*:","BUF","*:","BUF","*:","BUF","*:","BUF","*:","BUF","*:","BUF","*:","BUF","*:","BUF","*:","BUF","*:","BUF","*:","BUF","*:","BUF","*:","BUF",":","Monday Night Game",":","Monday Night Game",":","Monday Night Game","*:","LAC","*:","SF","*:","SF","*:","SF","*:","SF","*:","LAC"]
[":","Monday Night Games",":","Monday Night Games",":","Monday Night Games",":","Monday Night Games",":","Monday Night Games",":","Monday Night Games",":","Monday Night Games",":","Monday Night Games",":","Monday Night Games",":","Monday Night Games",":","Monday Night Games",":","Monday Night Games",":","Monday Night Games",":","Monday Night Games",":","Monday Night Games",":","Monday Night Games",":","Monday Night Games",":","Monday Night Games",":","Monday Night Games",":","Monday Night Games",":","Monday Night Games",":","Monday Night Games",":","Monday Night Games",":","Monday Night Games",":","Monday Night Games",":","Monday Night Games",":","Monday Night Games",":","Monday Night Games",":","Monday Night Games",":","Monday Night Games",":","Monday Night Games",":","Monday Night Games",":","Monday Night Games",":","Monday Night Games",":","Monday Night Games",":","Monday Night Games",":","Monday Night Games",":","Monday Night Games","*:","PIT","*:","PIT","*:","PIT",":","Monday Night Game",":","Monday Night Game",":","Monday Night Game",":","Monday Night Game",":","Monday Night Game",":","Monday Night Game"]
["*:","DEN","*:","CLE","*:","DEN","*:","DEN","*:","DEN","*:","DEN","*:","DEN","*:","DEN","*:","DEN","*:","DEN","*:","CLE","*:","DEN","*:","DEN","*:","DEN","*:","DEN","*:","DEN","*:","DEN","*:","DEN","*:","DEN","*:","DEN","*:","DEN","*:","DEN","*:","DEN","*:","DEN","*:","DEN","*:","DEN","*:","CLE","*:","DEN","*:","DEN","*:","DEN","*:","DEN","*:","DEN","*:","DEN","*:","DEN","*:","CLE","*:","DEN","*:","CLE","*:","DEN","Monday Night Total Score*:",36,"Monday Night Total Score*:",37,"Monday Night Total Score*:",46,"*:","PHI","*:","PHI","*:","PHI","*:","PHI","*:","PHI","*:","PHI"]
["Sunday Night Total Score*:",31,"Sunday Night Total Score*:",31,"Sunday Night Total Score*:",45,"Sunday Night Total Score*:",45,"Sunday Night Total Score*:",43,"Sunday Night Total Score*:",45,"Sunday Night Total Score*:",38,"Sunday Night Total Score*:",42,"Sunday Night Total Score*:",51,"Sunday Night Total Score*:",44,"Sunday Night Total Score*:",50,"Sunday Night Total Score*:",45,"Sunday Night Total Score*:",48,"Sunday Night Total Score*:",55,"Sunday Night Total Score*:",45,"Sunday Night Total Score*:",49,"Sunday Night Total Score*:",44,"Sunday Night Total Score*:",44,"Sunday Night Total Score*:",44,"Sunday Night Total Score*:",47,"Sunday Night Total Score*:",44,"Sunday Night Total Score*:",44,"Sunday Night Total Score*:",45,"Sunday Night Total Score*:",44,"Sunday Night Total Score*:",48,"Sunday Night Total Score*:",47,"Sunday Night Total Score*:",45,"Sunday Night Total Score*:",48,"Sunday Night Total Score*:",62,"Sunday Night Total Score*:",45,"Sunday Night Total Score*:",40,"Sunday Night Total Score*:",52,"Sunday Night Total Score*:",44,"Sunday Night Total Score*:",46,"Sunday Night Total Score*:",38,"Sunday Night Total Score*:",45,"Sunday Night Total Score*:",39,"Sunday Night Total Score*:",42,"Sunday Night Total Score*:",48,"Sunday Night Total Score*:",42,"Sunday Night Total Score*:",34,"Monday Night Total Score*:",53,"Monday Night Total Score*:",42,"Monday Night Total Score*:",42,"Monday Night Total Score*:",42,"Monday Night Total Score*:",45,"Monday Night Total Score*:",35]
["Monday Night Total Score*:",31,"Monday Night Total Score*:",38,"Monday Night Total Score*:",40,"Monday Night Total Score*:",39,"Monday Night Total Score*:",43,"Monday Night Total Score*:",45,"Monday Night Total Score*:",38,"Monday Night Total Score*:",38,"Monday Night Total Score*:",43,"Monday Night Total Score*:",42,"Monday Night Total Score*:",40,"Monday Night Total Score*:",42,"Monday Night Total Score*:",39,"Monday Night Total Score*:",40,"Monday Night Total Score*:",38,"Monday Night Total Score*:",42,"Monday Night Total Score*:",42,"Monday Night Total Score*:",42,"Monday Night Total Score*:",42,"Monday Night Total Score*:",42,"Monday Night Total Score*:",41,"Monday Night Total Score*:",42,"Monday Night Total Score*:",42,"Monday Night Total Score*:",45,"Monday Night Total Score*:",22,"Monday Night Total Score*:",38,"Monday Night Total Score*:",42,"Monday Night Total Score*:",45,"Monday Night Total Score*:",51,"Monday Night Total Score*:",43,"Monday Night Total Score*:",44,"Monday Night Total Score*:",45,"Monday Night Total Score*:",45,"Monday Night Total Score*:",38,"Monday Night Total Score*:",24,"Monday Night Total Score*:",43,"Monday Night Total Score*:",39,"Monday Night Total Score*:",44,"Name*:","Jack Williams","Name*:","Wayne Koopmann","Name*:","Chris Cochard","Sunday Night Total Score*:",54,"Sunday Night Total Score*:",45,"Sunday Night Total Score*:",45,"Sunday Night Total Score*:",42,"Sunday Night Total Score*:",45,"Sunday Night Total Score*:",42]
["Name*:","Dave Hepler","Name*:","Chris Cochard","Name*:","Keith Medved","Name*:","Jim Mcbride","Name*:","Ryan McBride","Name*:","Wayne DeLoria","Name*:","Mike Kestly","Name*:","Andy Bruck","Name*:","David King","Name*:","Jan DeLoria","Name*:","lee smith","Name*:","Chuck Lazar","Name*:","Julie DeLoria","Name*:","Chris McLaren","Name*:","Lynne Smith","Name*:","Nancy King","Name*:","Christie Ivie","Name*:","Casey Ivie","Name*:","Ken Ivie","Name*:","Bob Barbieri","Name*:","Lisa Rine","Name*:","Derek Sokolowski","Name*:","Kevin Ludwig","Name*:","Carol Alter","Name*:","Rayo Nulsen","Name*:","Aaron Smith","Name*:","Nello CERNOIA","Name*:","Nello CERNOIA","Name*:","Wayne Koopmann","Name*:","Wayne Koopmann","Name*:","Peter Smith","Name*:","Brian Hudock","Name*:","Posh Testa","Name*:","Pat Testa","Name*:","Rachel Dunn","Name*:","christopher martin","Name*:","Tony Morinello","Name*:","Larry Sokolowski","Nickname:",null,"Nickname:",null,"Nickname:",null,"Name*:","Don Megliola","Name*:","Jan DeLoria","Name*:","Jan DeLoria","Name*:","Wayne Koopmann","Name*:","Michael Bauman","Name*:","Tony Morinello"]
["Email:","Dhepler05@yahoo.com","Email:","chrismcochard@gmail.com","Email:","meds4@verizon.net","Email:","j333mcb@yahoo.com","Email:","Rmcbride47@gmail.com","Email:","wayned@deloriahurst.com","Email:","mike@kestlydevelopment.com","Email:","abruck@ameritech.net","Email:","kingdnbc@windstream.net","Email:","jan.deloria@gmail.com","Email:",null,"Email:","CharleslazarIII@gmail.com","Email:","julie@deloriahurst.com","Email:","mclarenchris99@yahoo.com","Email:","Ls4uconn@outlook.com","Email:","nqk64@windstream.net","Email:","misschrisp@yahoo.com","Email:","misschrisp@yahoo.com","Email:","misschrisp@yahoo.com","Email:","Bob_barbieri66@yahoo.com","Email:","Lisamarierine@gmail.com","Email:","dereksokolowski@gmail.com","Email:","kevinludwig62@yahoo.com","Email:","geraldalter@sbcglobal.net","Email:","rayo.nulsen@gmail.com","Email:","aaronjsmith1717@gmail.com","Email:","nello57@aol.com","Email:","nello57@aol.com","Email:","pyrt918@yahoo.com","Email:","pyrt918@yahoo.com","Email:","Psacsmith@cox.net","Email:","brian.hudock@gmail.com","Email:",null,"Email:",null,"Email:","rloved99@yahoo.com","Email:","Mainelytacos@gmail.com","Email:","MorinelloA@gmail.com","Email:","L.sokolowski@aol.com","Email:","Jackewilliams@hotmail.com","Email:","pyrt918@yahoo.com","Email:","chrismcochard@gmail.com","Nickname:",null,"Nickname:",null,"Nickname:",null,"Nickname:",null,"Nickname:",null,"Nickname:","Ralph"]
["Nickname (use only one per season) :",null,"Nickname (use only one per season) :",null,"Nickname (use only one per season) :",null,"Nickname (use only one per season) :","Bake","Nickname (use only one per season) :",null,"Nickname (use only one per season) :",null,"Nickname (use only one per season) :",null,"Nickname (use only one per season) :",null,"Nickname (use only one per season) :","Sky King","Nickname (use only one per season) :",null,"Nickname (use only one per season) :",null,"Nickname (use only one per season) :",null,"Nickname (use only one per season) :",null,"Nickname (use only one per season) :","Pickled","Nickname (use only one per season) :",null,"Nickname (use only one per season) :","Lucky lady","Nickname (use only one per season) :","Miss Chris","Nickname (use only one per season) :","Casey","Nickname (use only one per season) :",null,"Nickname (use only one per season) :","TRIPLE B’S","Nickname (use only one per season) :",null,"Nickname (use only one per season) :",null,"Nickname (use only one per season) :",null,"Nickname (use only one per season) :",null,"Nickname (use only one per season) :",null,"Nickname (use only one per season) :",null,"Nickname (use only one per season) :","CLEVELANDER","Nickname (use only one per season) :","CLEVELANDER","Nickname (use only one per season) :",null,"Nickname (use only one per season) :",null,"Nickname (use only one per season) :",null,"Nickname (use only one per season) :","Hudie","Nickname (use only one per season) :",null,"Nickname (use only one per season) :",null,"Nickname (use only one per season) :",null,"Nickname (use only one per season) :",null,"Nickname (use only one per season) :","Ralph","Nickname (use only one per season) :",null,"Phone*:","724-516-7257","Phone*:","563-580-0497","Phone*:","609-204-0327","Email:",null,"Email:","Jan.deloria@gmail.com","Email:","Jan.deloria@gmail.com","Email:","pyrt918@yahoo.com","Email:","baumanmj@gmail.com","Email:","morinelloa@gmail.com"]
["Phone*:","734-489-3797","Phone*:","609-204-0327","Phone*:","412-367-9203","Phone*:","412-334-6340","Phone*:","412-335-9829","Phone*:","222-222-2222","Phone*:","111-111-1111","Phone*:","614-216-7269","Phone*:","724-989-3246","Phone*:","678-492-8397","Phone*:","352-775-4843","Phone*:","412-999-5163","Phone*:","703-402-0626","Phone*:","206-819-3910","Phone*:","703-585-7887","Phone*:","724-309-4803","Phone*:","562-208-8570","Phone*:","562-208-8570","Phone*:","562-208-8570","Phone*:","724-244-2916","Phone*:","614-975-5034","Phone*:","608-358-9719","Phone*:","614-313-2614","Phone*:","586-219-7960","Phone*:","734-276-6100","Phone*:","860-819-9697","Phone*:","239-822-8122","Phone*:","239-822-8122","Phone*:","563-580-0497","Phone*:","563-580-0497","Phone*:","860-874-8909","Phone*:","724-322-6819","Phone*:","734-812-8078","Phone*:","734-812-8078","Phone*:","310-293-8116","Phone*:","928-848-4206","Phone*:","412-877-4013","Phone*:","608-358-9134","Comments:",null,"Comments:",null,"Comments:",null,"Phone*:","703-969-5710","Phone*:","678-492-8397","Phone*:","678-492-8397","Phone*:","563-580-0497","Phone*:","269-420-8107","Phone*:","412-877-4013"]
["Comments:",null,"Comments:",null,"Comments:",null,"Comments:",null,"Comments:",null,"Comments:",null,"Comments:",null,"Comments:","Go Bucks!","Comments:",null,"Comments:",null,"Comments:",null,"Comments:",null,"Comments:",null,"Comments:",null,"Comments:",null,"Comments:",null,"Comments:","Thank You & Have a Great Thanksgiving!!! :)","Comments:","Thank You & Have a Great Thanksgiving!!! :)","Comments:",null,"Comments:",null,"Comments:",null,"Comments:",null,"Comments:",null,"Comments:","GO LIONS","Comments:",null,"Comments:",null,"Comments:","GO BUCKS!","Comments:","GO BUCKS!","Comments:",null,"Comments:",null,"Comments:",null,"Comments:",null,"Comments:",null,"Comments:",null,"Comments:",null,"Comments:",null,"Comments:",null,"Comments:",null,"Corrected entry? (use this if you are correcting or updating a previously submitted entry)*:","No","Corrected entry? (use this if you are correcting or updating a previously submitted entry)*:","No","Corrected entry? (use this if you are correcting or updating a previously submitted entry)*:","Yes","Comments:",null,"Comments:",null,"Comments:",null,"Comments:",null,"Comments:",null,"Comments:"]
["Corrected entry? (use this if you are correcting or updating a previously submitted entry)*:","No","Corrected entry? (use this if you are correcting or updating a previously submitted entry)*:","Yes","Corrected entry? (use this if you are correcting or updating a previously submitted entry)*:","No","Corrected entry? (use this if you are correcting or updating a previously submitted entry)*:","No","Corrected entry? (use this if you are correcting or updating a previously submitted entry)*:","No","Corrected entry? (use this if you are correcting or updating a previously submitted entry)*:","No","Corrected entry? (use this if you are correcting or updating a previously submitted entry)*:","No","Corrected entry? (use this if you are correcting or updating a previously submitted entry)*:","Yes","Corrected entry? (use this if you are correcting or updating a previously submitted entry)*:","Yes","Corrected entry? (use this if you are correcting or updating a previously submitted entry)*:","No","Corrected entry? (use this if you are correcting or updating a previously submitted entry)*:","No","Corrected entry? (use this if you are correcting or updating a previously submitted entry)*:","No","Corrected entry? (use this if you are correcting or updating a previously submitted entry)*:","No","Corrected entry? (use this if you are correcting or updating a previously submitted entry)*:","No","Corrected entry? (use this if you are correcting or updating a previously submitted entry)*:","No","Corrected entry? (use this if you are correcting or updating a previously submitted entry)*:","No","Corrected entry? (use this if you are correcting or updating a previously submitted entry)*:","No","Corrected entry? (use this if you are correcting or updating a previously submitted entry)*:","No","Corrected entry? (use this if you are correcting or updating a previously submitted entry)*:","No","Corrected entry? (use this if you are correcting or updating a previously submitted entry)*:","No","Corrected entry? (use this if you are correcting or updating a previously submitted entry)*:","No","Corrected entry? (use this if you are correcting or updating a previously submitted entry)*:","No","Corrected entry? (use this if you are correcting or updating a previously submitted entry)*:","No","Corrected entry? (use this if you are correcting or updating a previously submitted entry)*:","No","Corrected entry? (use this if you are correcting or updating a previously submitted entry)*:","No","Corrected entry? (use this if you are correcting or updating a previously submitted entry)*:","No","Corrected entry? (use this if you are correcting or updating a previously submitted entry)*:","No","Corrected entry? (use this if you are correcting or updating a previously submitted entry)*:","No","Corrected entry? (use this if you are correcting or updating a previously submitted entry)*:","No","Corrected entry? (use this if you are correcting or updating a previously submitted entry)*:","No","Corrected entry? (use this if you are correcting or updating a previously submitted entry)*:","No","Corrected entry? (use this if you are correcting or updating a previously submitted entry)*:","No","Corrected entry? (use this if you are correcting or updating a previously submitted entry)*:","No","Corrected entry? (use this if you are correcting or updating a previously submitted entry)*:","No","Corrected entry? (use this if you are correcting or updating a previously submitted entry)*:","No","Corrected entry? (use this if you are correcting or updating a previously submitted entry)*:","No","Corrected entry? (use this if you are correcting or updating a previously submitted entry)*:","No","Corrected entry? (use this if you are correcting or updating a previously submitted entry)*:","No","Is this an additional entry? If yes please indicate the entry number (2,3, etc) in the field below.*:","No","Is this an additional entry? If yes please indicate the entry number (2,3, etc) in the field below.*:","No","Is this an additional entry? If yes please indicate the entry number (2,3, etc) in the field below.*:","No","Corrected entry? (use this if you are correcting or updating a previously submitted entry)*:","No","Corrected entry? (use this if you are correcting or updating a previously submitted entry)*:","No","Corrected entry? (use this if you are correcting or updating a previously submitted entry)*:","No","Corrected entry? (use this if you are correcting or updating a previously submitted entry)*:","No","Corrected entry? (use this if you are correcting or updating a previously submitted entry)*:","No","Corrected entry? (use this if you are correcting or updating a previously submitted entry)*:","No"]
["Is this an additional entry? If yes please indicate the entry number (2,3, etc) in the field below.*:","No","Is this an additional entry? If yes please indicate the entry number (2,3, etc) in the field below.*:","No","Is this an additional entry? If yes please indicate the entry number (2,3, etc) in the field below.*:","No","Is this an additional entry? If yes please indicate the entry number (2,3, etc) in the field below.*:","No","Is this an additional entry? If yes please indicate the entry number (2,3, etc) in the field below.*:","No","Is this an additional entry? If yes please indicate the entry number (2,3, etc) in the field below.*:","No","Is this an additional entry? If yes please indicate the entry number (2,3, etc) in the field below.*:","No","Is this an additional entry? If yes please indicate the entry number (2,3, etc) in the field below.*:","No","Is this an additional entry? If yes please indicate the entry number (2,3, etc) in the field below.*:","No","Is this an additional entry? If yes please indicate the entry number (2,3, etc) in the field below.*:","No","Is this an additional entry? If yes please indicate the entry number (2,3, etc) in the field below.*:","No","Is this an additional entry? If yes please indicate the entry number (2,3, etc) in the field below.*:","No","Is this an additional entry? If yes please indicate the entry number (2,3, etc) in the field below.*:","No","Is this an additional entry? If yes please indicate the entry number (2,3, etc) in the field below.*:","No","Is this an additional entry? If yes please indicate the entry number (2,3, etc) in the field below.*:","No","Is this an additional entry? If yes please indicate the entry number (2,3, etc) in the field below.*:","No","Is this an additional entry? If yes please indicate the entry number (2,3, etc) in the field below.*:","No","Is this an additional entry? If yes please indicate the entry number (2,3, etc) in the field below.*:","No","Is this an additional entry? If yes please indicate the entry number (2,3, etc) in the field below.*:","No","Is this an additional entry? If yes please indicate the entry number (2,3, etc) in the field below.*:","No","Is this an additional entry? If yes please indicate the entry number (2,3, etc) in the field below.*:","No","Is this an additional entry? If yes please indicate the entry number (2,3, etc) in the field below.*:","No","Is this an additional entry? If yes please indicate the entry number (2,3, etc) in the field below.*:","No","Is this an additional entry? If yes please indicate the entry number (2,3, etc) in the field below.*:","No","Is this an additional entry? If yes please indicate the entry number (2,3, etc) in the field below.*:","No","Is this an additional entry? If yes please indicate the entry number (2,3, etc) in the field below.*:","No","Is this an additional entry? If yes please indicate the entry number (2,3, etc) in the field below.*:","No","Is this an additional entry? If yes please indicate the entry number (2,3, etc) in the field below.*:","Yes","Is this an additional entry? If yes please indicate the entry number (2,3, etc) in the field below.*:","No","Is this an additional entry? If yes please indicate the entry number (2,3, etc) in the field below.*:","Yes","Is this an additional entry? If yes please indicate the entry number (2,3, etc) in the field below.*:","No","Is this an additional entry? If yes please indicate the entry number (2,3, etc) in the field below.*:","No","Is this an additional entry? If yes please indicate the entry number (2,3, etc) in the field below.*:","No","Is this an additional entry? If yes please indicate the entry number (2,3, etc) in the field below.*:","No","Is this an additional entry? If yes please indicate the entry number (2,3, etc) in the field below.*:","No","Is this an additional entry? If yes please indicate the entry number (2,3, etc) in the field below.*:","No","Is this an additional entry? If yes please indicate the entry number (2,3, etc) in the field below.*:","No","Is this an additional entry? If yes please indicate the entry number (2,3, etc) in the field below.*:","No","Entry Number:",null,"Entry Number:",1,"Entry Number:",null,"Is this an additional entry? If yes please indicate the entry number (2,3, etc) in the field below.*:","No","Is this an additional entry? If yes please indicate the entry number (2,3, etc) in the field below.*:","No","Is this an additional entry? If yes please indicate the entry number (2,3, etc) in the field below.*:","No","Is this an additional entry? If yes please indicate the entry number (2,3, etc) in the field below.*:","No","Is this an additional entry? If yes please indicate the entry number (2,3, etc) in the field below.*:","No","Is this an additional entry? If yes please indicate the entry number (2,3, etc) in the field below.*:","No"]
["Entry Number:",null,"Entry Number:",null,"Entry Number:",null,"Entry Number:",1,"Entry Number:",null,"Entry Number:",null,"Entry Number:",null,"Entry Number:",1,"Entry Number:",null,"Entry Number:",null,"Entry Number:",1,"Entry Number:",1,"Entry Number:",null,"Entry Number:",null,"Entry Number:",null,"Entry Number:",null,"Entry Number:",null,"Entry Number:",null,"Entry Number:",null,"Entry Number:",1,"Entry Number:",null,"Entry Number:",1,"Entry Number:",1,"Entry Number:",null,"Entry Number:",null,"Entry Number:",1,"Entry Number:",1,"Entry Number:",2,"Entry Number:",1,"Entry Number:",2,"Entry Number:",1,"Entry Number:",null,"Entry Number:",1,"Entry Number:",1,"Entry Number:",null,"Entry Number:",1,"Entry Number:",1,"Entry Number:",1,"Entry Number:",1,"Entry Number:",null,"Entry Number:",null,"Entry Number:",1,"Entry Number:",null,"Entry Number:",null,"Entry Number:",1,"Entry Number:",null,"Entry Number:",1]
["Is this an additional entry? If yes please indicate the entry number (2,3, etc) in the field below.*:","No",null,{"$f":"D44","v":"chrismcochard@gmail.com"},"Is this an additional entry? If yes please indicate the entry number (2,3, etc) in the field below.*:","No",null,{"$f":"H44","v":"j333mcb@yahoo.com"},"Entry Number:",null,null,{"$f":"L44","v":"wayned@deloriahurst.com"},null,{"$f":"N44","v":"mike@kestlydevelopment.com"}]
[null,{"$f":"B43","v":"Dave Hepler"},null,{"$f":"D43","v":"Chris Cochard"},null,{"$f":"F43","v":"Keith Medved"},null,{"$f":"H43","v":"Jim Mcbride"},null,{"$f":"J43","v":"Ryan McBride"},null,{"$f":"L43","v":"Wayne DeLoria"},null,{"$f":"N43","v":"Mike Kestly"},null,{"$f":"P43","v":"Andy Bruck"},null,{"$f":"R43","v":"David King"},null,{"$f":"T43","v":"Jan DeLoria"},null,{"$f":"V43","v":"lee smith"},null,{"$f":"X43","v":"Chuck Lazar"},null,{"$f":"Z43","v":"Julie DeLoria"},null,{"$f":"AB43","v":"Chris McLaren"},null,{"$f":"AD43","v":"Lynne Smith"},null,{"$f":"AF43","v":"Nancy King"},null,{"$f":"AH43","v":"Christie Ivie"},null,{"$f":"AJ43","v":"Casey Ivie"},null,{"$f":"AL43","v":"Ken Ivie"},null,{"$f":"AN43","v":"Bob Barbieri"},null,{"$f":"AP43","v":"Lisa Rine"},null,{"$f":"AR43","v":"Derek Sokolowski"},null,{"$f":"AT43","v":"Kevin Ludwig"},null,{"$f":"AV43","v":"Carol Alter"},null,{"$f":"AX43","v":"Rayo Nulsen"},null,{"$f":"AZ43","v":"Aaron Smith"},null,{"$f":"BB43","v":"Nello CERNOIA"},null,{"$f":"BD43","v":"Nello CERNOIA"},null,{"$f":"BF43","v":"Wayne Koopmann"},null,{"$f":"BH43","v":"Wayne Koopmann"},null,{"$f":"BJ43","v":"Peter Smith"},null,{"$f":"BL43","v":"Brian Hudock"},null,{"$f":"BN43","v":"Posh Testa"},null,{"$f":"BP43","v":"Pat Testa"},null,{"$f":"BR43","v":"Rachel Dunn"},null,{"$f":"BT43","v":"christopher martin"},null,{"$f":"BV43","v":"Tony Morinello"},null,{"$f":"BX43","v":"Larry Sokolowski"},null,{"$f":"BZ43","v":0},null,{"$f":"CB43","v":0},null,{"$f":"CD43","v":0},null,{"$f":"CF43","v":"Don Megliola"},null,{"$f":"CH43","v":"Jan DeLoria"},null,{"$f":"CJ43","v":"Jan DeLoria"},null,{"$f":"CL43","v":"Wayne Koopmann"},null,{"$f":"CN43","v":"Michael Bauman"},null,{"$f":"CP43","v":"Tony Morinello"},null,{"$f":"CR43","v":0},null,{"$f":"CT43","v":0}]
[null,{"$f":"B21","v":"DET"},null,{"$f":"D21","v":"DET"},null,{"$f":"F21","v":"DET"},null,{"$f":"H21","v":"DET"},null,{"$f":"J21","v":"DET"},null,{"$f":"L21","v":"DET"},null,{"$f":"N21","v":"DET"},null,{"$f":"P21","v":"DET"},null,{"$f":"R21","v":"DET"},null,{"$f":"T21","v":"DET"},null,{"$f":"V21","v":"DET"},null,{"$f":"X21","v":"DET"},null,{"$f":"Z21","v":"DET"},null,{"$f":"AB21","v":"DET"},null,{"$f":"AD21","v":"DET"},null,{"$f":"AF21","v":"DET"},null,{"$f":"AH21","v":"DET"},null,{"$f":"AJ21","v":"DET"},null,{"$f":"AL21","v":"DET"},null,{"$f":"AN21","v":"DET"},null,{"$f":"AP21","v":"DET"},null,{"$f":"AR21","v":"DET"},null,{"$f":"AT21","v":"DET"},null,{"$f":"AV21","v":"DET"},null,{"$f":"AX21","v":"DET"},null,{"$f":"AZ21","v":"DET"},null,{"$f":"BB21","v":"DET"},null,{"$f":"BD21","v":"DET"},null,{"$f":"BF21","v":"DET"},null,{"$f":"BH21","v":"DET"},null,{"$f":"BJ21","v":"DET"},null,{"$f":"BL21","v":"DET"},null,{"$f":"BN21","v":"DET"},null,{"$f":"BP21","v":"DET"},null,{"$f":"BR21","v":"DET"},null,{"$f":"BT21","v":"DET"},null,{"$f":"BV21","v":"DET"},null,{"$f":"BX21","v":"DET"},null,{"$f":"BZ21","v":"BUF"},null,{"$f":"CB21","v":"BUF"},null,{"$f":"CD21","v":"BUF"},null,{"$f":"CF21","v":0},null,{"$f":"CH21","v":0},null,{"$f":"CJ21","v":0},null,{"$f":"CL21","v":0},null,{"$f":"CN21","v":0},null,{"$f":"CP21","v":0},null,{"$f":"CR21","v":0},null,{"$f":"CT21","v":0}]
[null,{"$f":"B22","v":"DAL"},null,{"$f":"D22","v":"DAL"},null,{"$f":"F22","v":"DAL"},null,{"$f":"H22","v":"DAL"},null,{"$f":"J22","v":"DAL"},null,{"$f":"L22","v":"DAL"},null,{"$f":"N22","v":"DAL"},null,{"$f":"P22","v":"DAL"},null,{"$f":"R22","v":"DAL"},null,{"$f":"T22","v":"DAL"},null,{"$f":"V22","v":"DAL"},null,{"$f":"X22","v":"DAL"},null,{"$f":"Z22","v":"DAL"},null,{"$f":"AB22","v":"DAL"},null,{"$f":"AD22","v":"DAL"},null,{"$f":"AF22","v":"DAL"},null,{"$f":"AH22","v":"DAL"},null,{"$f":"AJ22","v":"DAL"},null,{"$f":"AL22","v":"DAL"},null,{"$f":"AN22","v":"DAL"},null,{"$f":"AP22","v":"DAL"},null,{"$f":"AR22","v":"DAL"},null,{"$f":"AT22","v":"DAL"},null,{"$f":"AV22","v":"DAL"},null,{"$f":"AX22","v":"DAL"},null,{"$f":"AZ22","v":"DAL"},null,{"$f":"BB22","v":"DAL"},null,{"$f":"BD22","v":"DAL"},null,{"$f":"BF22","v":"DAL"},null,{"$f":"BH22","v":"DAL"},null,{"$f":"BJ22","v":"DAL"},null,{"$f":"BL22","v":"DAL"},null,{"$f":"BN22","v":"DAL"},null,{"$f":"BP22","v":"DAL"},null,{"$f":"BR22","v":"DAL"},null,{"$f":"BT22","v":"DAL"},null,{"$f":"BV22","v":"DAL"},null,{"$f":"BX22","v":"DAL"},null,{"$f":"BZ22","v":"NYG"},null,{"$f":"CB22","v":"DAL"},null,{"$f":"CD22","v":"DAL"},null,{"$f":"CF22","v":0},null,{"$f":"CH22","v":0},null,{"$f":"CJ22","v":0},null,{"$f":"CL22","v":0},null,{"$f":"CN22","v":0},null,{"$f":"CP22","v":0},null,{"$f":"CR22","v":0},null,{"$f":"CT22","v":0}]
[null,{"$f":"B23","v":"MIA"},null,{"$f":"D23","v":"GB"},null,{"$f":"F23","v":"GB"},null,{"$f":"H23","v":"GB"},null,{"$f":"J23","v":"GB"},null,{"$f":"L23","v":"GB"},null,{"$f":"N23","v":"GB"},null,{"$f":"P23","v":"GB"},null,{"$f":"R23","v":"GB"},null,{"$f":"T23","v":"GB"},null,{"$f":"V23","v":"MIA"},null,{"$f":"X23","v":"GB"},null,{"$f":"Z23","v":"GB"},null,{"$f":"AB23","v":"GB"},null,{"$f":"AD23","v":"GB"},null,{"$f":"AF23","v":"GB"},null,{"$f":"AH23","v":"GB"},null,{"$f":"AJ23","v":"GB"},null,{"$f":"AL23","v":"GB"},null,{"$f":"AN23","v":"GB"},null,{"$f":"AP23","v":"MIA"},null,{"$f":"AR23","v":"GB"},null,{"$f":"AT23","v":"GB"},null,{"$f":"AV23","v":"MIA"},null,{"$f":"AX23","v":"MIA"},null,{"$f":"AZ23","v":"GB"},null,{"$f":"BB23","v":"GB"},null,{"$f":"BD23","v":"GB"},null,{"$f":"BF23","v":"GB"},null,{"$f":"BH23","v":"GB"},null,{"$f":"BJ23","v":"GB"},null,{"$f":"BL23","v":"MIA"},null,{"$f":"BN23","v":"MIA"},null,{"$f":"BP23","v":"GB"},null,{"$f":"BR23","v":"MIA"},null,{"$f":"BT23","v":"GB"},null,{"$f":"BV23","v":"GB"},null,{"$f":"BX23","v":"GB"},null,{"$f":"BZ23","v":"MIN"},null,{"$f":"CB23","v":"MIN"},null,{"$f":"CD23","v":"NE"},null,{"$f":"CF23","v":0},null,{"$f":"CH23","v":0},null,{"$f":"CJ23","v":0},null,{"$f":"CL23","v":0},null,{"$f":"CN23","v":0},null,{"$f":"CP23","v":0},null,{"$f":"CR23","v":0},null,{"$f":"CT23","v":0}]
[]
[null,{"$f":"B25","v":"KC"},null,"KC",null,{"$f":"F25","v":"KC"},null,{"$f":"H25","v":"KC"},null,{"$f":"J25","v":"KC"},null,{"$f":"L25","v":"KC"},null,{"$f":"N25","v":"KC"},null,{"$f":"P25","v":"KC"},null,{"$f":"R25","v":"KC"},null,{"$f":"T25","v":"KC"},null,{"$f":"V25","v":"KC"},null,{"$f":"X25","v":"KC"},null,{"$f":"Z25","v":"KC"},null,{"$f":"AB25","v":"KC"},null,{"$f":"AD25","v":"KC"},null,{"$f":"AF25","v":"KC"},null,{"$f":"AH25","v":"KC"},null,{"$f":"AJ25","v":"KC"},null,{"$f":"AL25","v":"KC"},null,{"$f":"AN25","v":"KC"},null,{"$f":"AP25","v":"KC"},null,{"$f":"AR25","v":"KC"},null,{"$f":"AT25","v":"KC"},null,{"$f":"AV25","v":"KC"},null,{"$f":"AX25","v":"KC"},null,{"$f":"AZ25","v":"KC"},null,{"$f":"BB25","v":"KC"},null,{"$f":"BD25","v":"KC"},null,{"$f":"BF25","v":"KC"},null,"KC",null,{"$f":"BJ25","v":"KC"},null,{"$f":"BL25","v":"KC"},null,{"$f":"BN25","v":"KC"},null,{"$f":"BP25","v":"KC"},null,{"$f":"BR25","v":"KC"},null,{"$f":"BT25","v":"KC"},null,{"$f":"BV25","v":"KC"},null,{"$f":"BX25","v":"KC"},null,{"$f":"BZ25","v":"TB"},null,{"$f":"CB25","v":"TB"},null,{"$f":"CD25","v":"TB"},null,{"$f":"CF25","v":"MIN"},null,{"$f":"CH25","v":"BUF"},null,{"$f":"CJ25","v":"BUF"},null,{"$f":"CL25","v":"BUF"},null,{"$f":"CN25","v":"BUF"},null,{"$f":"CP25","v":"BUF"},null,{"$f":"CR25","v":0},null,{"$f":"CT25","v":0}]
[]
[null,"ATL",null,"LAC",null,{"$f":"F27","v":"LAC"},null,{"$f":"H27","v":"LAC"},null,{"$f":"J27","v":"LAC"},null,{"$f":"L27","v":"ATL"},null,{"$f":"N27","v":"LAC"},null,{"$f":"P27","v":"LAC"},null,{"$f":"R27","v":"ATL"},null,{"$f":"T27","v":"LAC"},null,{"$f":"V27","v":"LAC"},null,{"$f":"X27","v":"LAC"},null,{"$f":"Z27","v":"ATL"},null,{"$f":"AB27","v":"ATL"},null,{"$f":"AD27","v":"LAC"},null,{"$f":"AF27","v":"ATL"},null,{"$f":"AH27","v":"LAC"},null,{"$f":"AJ27","v":"LAC"},null,{"$f":"AL27","v":"LAC"},null,{"$f":"AN27","v":"LAC"},null,{"$f":"AP27","v":"LAC"},null,{"$f":"AR27","v":"LAC"},null,{"$f":"AT27","v":"ATL"},null,{"$f":"AV27","v":"LAC"},null,{"$f":"AX27","v":"ATL"},null,{"$f":"AZ27","v":"LAC"},null,{"$f":"BB27","v":"ATL"},null,{"$f":"BD27","v":"LAC"},null,{"$f":"BF27","v":"LAC"},null,"LAC",null,{"$f":"BJ27","v":"LAC"},null,{"$f":"BL27","v":"LAC"},null,{"$f":"BN27","v":"LAC"},null,{"$f":"BP27","v":"ATL"},null,{"$f":"BR27","v":"ATL"},null,{"$f":"BT27","v":"ATL"},null,{"$f":"BV27","v":"ATL"},null,{"$f":"BX27","v":"LAC"},null,{"$f":"BZ27","v":"MIA"},null,{"$f":"CB27","v":"MIA"},null,{"$f":"CD27","v":"MIA"},null,{"$f":"CF27","v":"TEN"},null,{"$f":"CH27","v":"TEN"},null,{"$f":"CJ27","v":"TEN"},null,{"$f":"CL27","v":"TEN"},null,{"$f":"CN27","v":"TEN"},null,{"$f":"CP27","v":"TEN"},null,{"$f":"CR27","v":0},null,{"$f":"CT27","v":0}]
[null,"CIN",null,"PIT",null,{"$f":"F28","v":"PIT"},null,{"$f":"H28","v":"CIN"},null,{"$f":"J28","v":"PIT"},null,{"$f":"L28","v":"CIN"},null,{"$f":"N28","v":"PIT"},null,{"$f":"P28","v":"CIN"},null,{"$f":"R28","v":"CIN"},null,{"$f":"T28","v":"PIT"},null,{"$f":"V28","v":"PIT"},null,{"$f":"X28","v":"PIT"},null,{"$f":"Z28","v":"PIT"},null,{"$f":"AB28","v":"CIN"},null,{"$f":"AD28","v":"CIN"},null,{"$f":"AF28","v":"CIN"},null,{"$f":"AH28","v":"CIN"},null,{"$f":"AJ28","v":"CIN"},null,{"$f":"AL28","v":"PIT"},null,{"$f":"AN28","v":"PIT"},null,{"$f":"AP28","v":"CIN"},null,{"$f":"AR28","v":"CIN"},null,{"$f":"AT28","v":"CIN"},null,{"$f":"AV28","v":"CIN"},null,{"$f":"AX28","v":"CIN"},null,{"$f":"AZ28","v":"CIN"},null,{"$f":"BB28","v":"CIN"},null,{"$f":"BD28","v":"CIN"},null,{"$f":"BF28","v":"CIN"},null,"PIT",null,{"$f":"BJ28","v":"PIT"},null,{"$f":"BL28","v":"PIT"},null,{"$f":"BN28","v":"PIT"},null,{"$f":"BP28","v":"CIN"},null,{"$f":"BR28","v":"PIT"},null,{"$f":"BT28","v":"PIT"},null,{"$f":"BV28","v":"PIT"},null,{"$f":"BX28","v":"CIN"},null,{"$f":"BZ28","v":"CHI"},null,{"$f":"CB28","v":"CHI"},null,{"$f":"CD28","v":"NYJ"},null,{"$f":"CF28","v":"KC"},null,{"$f":"CH28","v":"KC"},null,{"$f":"CJ28","v":"KC"},null,{"$f":"CL28","v":"KC"},null,{"$f":"CN28","v":"KC"},null,{"$f":"CP28","v":"KC"},null,{"$f":"CR28","v":0},null,{"$f":"CT28","v":0}]
[null,"MIN",null,"AZ",null,{"$f":"F29","v":"MIN"},null,{"$f":"H29","v":"MIN"},null,{"$f":"J29","v":"MIN"},null,{"$f":"L29","v":"MIN"},null,{"$f":"N29","v":"MIN"},null,{"$f":"P29","v":"MIN"},null,{"$f":"R29","v":"MIN"},null,{"$f":"T29","v":"MIN"},null,{"$f":"V29","v":"MIN"},null,{"$f":"X29","v":"MIN"},null,{"$f":"Z29","v":"MIN"},null,{"$f":"AB29","v":"MIN"},null,{"$f":"AD29","v":"MIN"},null,{"$f":"AF29","v":"MIN"},null,{"$f":"AH29","v":"MIN"},null,{"$f":"AJ29","v":"MIN"},null,{"$f":"AL29","v":"MIN"},null,{"$f":"AN29","v":"MIN"},null,{"$f":"AP29","v":"MIN"},null,{"$f":"AR29","v":"MIN"},null,{"$f":"AT29","v":"MIN"},null,{"$f":"AV29","v":"AZ"},null,{"$f":"AX29","v":"AZ"},null,{"$f":"AZ29","v":"MIN"},null,{"$f":"BB29","v":"MIN"},null,{"$f":"BD29","v":"AZ"},null,{"$f":"BF29","v":"MIN"},null,"MIN",null,{"$f":"BJ29","v":"MIN"},null,{"$f":"BL29","v":"MIN"},null,{"$f":"BN29","v":"MIN"},null,{"$f":"BP29","v":"MIN"},null,{"$f":"BR29","v":"MIN"},null,{"$f":"BT29","v":"MIN"},null,{"$f":"BV29","v":"MIN"},null,{"$f":"BX29","v":"MIN"},null,{"$f":"BZ29","v":"ATL"},null,{"$f":"CB29","v":"WAS"},null,{"$f":"CD29","v":"WAS"},null,{"$f":"CF29","v":"MIA"},null,{"$f":"CH29","v":"MIA"},null,{"$f":"CJ29","v":"MIA"},null,{"$f":"CL29","v":"MIA"},null,{"$f":"CN29","v":"MIA"},null,{"$f":"CP29","v":"CLE"},null,{"$f":"CR29","v":0},null,{"$f":"CT29","v":0}]
[null,"IND",null,"IND",null,{"$f":"F30","v":"IND"},null,{"$f":"H30","v":"IND"},null,{"$f":"J30","v":"IND"},null,{"$f":"L30","v":"IND"},null,{"$f":"N30","v":"IND"},null,{"$f":"P30","v":"IND"},null,{"$f":"R30","v":"IND"},null,{"$f":"T30","v":"IND"},null,{"$f":"V30","v":"IND"},null,{"$f":"X30","v":"IND"},null,{"$f":"Z30","v":"IND"},null,{"$f":"AB30","v":"NE"},null,{"$f":"AD30","v":"IND"},null,{"$f":"AF30","v":"IND"},null,{"$f":"AH30","v":"IND"},null,{"$f":"AJ30","v":"IND"},null,{"$f":"AL30","v":"IND"},null,{"$f":"AN30","v":"IND"},null,{"$f":"AP30","v":"IND"},null,{"$f":"AR30","v":"NE"},null,{"$f":"AT30","v":"IND"},null,{"$f":"AV30","v":"IND"},null,{"$f":"AX30","v":"IND"},null,{"$f":"AZ30","v":"IND"},null,{"$f":"BB30","v":"IND"},null,{"$f":"BD30","v":"IND"},null,{"$f":"BF30","v":"IND"},null,"IND",null,{"$f":"BJ30","v":"IND"},null,{"$f":"BL30","v":"IND"},null,{"$f":"BN30","v":"IND"},null,{"$f":"BP30","v":"NE"},null,{"$f":"BR30","v":"IND"},null,{"$f":"BT30","v":"IND"},null,{"$f":"BV30","v":"IND"},null,{"$f":"BX30","v":"IND"},null,{"$f":"BZ30","v":"DEN"},null,{"$f":"CB30","v":"DEN"},null,{"$f":"CD30","v":"DEN"},null,{"$f":"CF30","v":"NYG"},null,{"$f":"CH30","v":"HOU"},null,{"$f":"CJ30","v":"HOU"},null,{"$f":"CL30","v":"NYG"},null,{"$f":"CN30","v":"NYG"},null,{"$f":"CP30","v":"HOU"},null,{"$f":"CR30","v":0},null,{"$f":"CT30","v":0}]
[null,"SEA",{"$f":"C34","v":"*:"},"SEA","*:",{"$f":"F31","v":"SEA"},"*:",{"$f":"H31","v":"SEA"},"*:",{"$f":"J31","v":"SEA"},"*:",{"$f":"L31","v":"NYJ"},"*:",{"$f":"N31","v":"NYJ"},"*:",{"$f":"P31","v":"SEA"},"*:",{"$f":"R31","v":"SEA"},{"$f":"S34","v":"*:"},{"$f":"T31","v":"SEA"},"*:",{"$f":"V31","v":"SEA"},"*:",{"$f":"X31","v":"NYJ"},"*:",{"$f":"Z31","v":"SEA"},"*:",{"$f":"AB31","v":"SEA"},"*:",{"$f":"AD31","v":"SEA"},"*:",{"$f":"AF31","v":"SEA"},"*:",{"$f":"AH31","v":"SEA"},{"$f":"AI34","v":"*:"},{"$f":"AJ31","v":"SEA"},"*:",{"$f":"AL31","v":"SEA"},"*:",{"$f":"AN31","v":"SEA"},"*:",{"$f":"AP31","v":"SEA"},"*:",{"$f":"AR31","v":"SEA"},"*:",{"$f":"AT31","v":"SEA"},"*:",{"$f":"AV31","v":"SEA"},"*:",{"$f":"AX31","v":"SEA"},{"$f":"AY34","v":"*:"},{"$f":"AZ31","v":"SEA"},"*:",{"$f":"BB31","v":"SEA"},"*:",{"$f":"BD31","v":"SEA"},"*:",{"$f":"BF31","v":"SEA"},"*:","SEA","*:",{"$f":"BJ31","v":"SEA"},"*:",{"$f":"BL31","v":"SEA"},"*:",{"$f":"BN31","v":"SEA"},{"$f":"BO34","v":"*:"},{"$f":"BP31","v":"NYJ"},"*:",{"$f":"BR31","v":"SEA"},"*:",{"$f":"BT31","v":"NYJ"},"*:",{"$f":"BV31","v":"SEA"},"*:",{"$f":"BX31","v":"SEA"},"*:",{"$f":"BZ31","v":"BAL"},"*:",{"$f":"CB31","v":"BAL"},"*:",{"$f":"CD31","v":"BAL"},{"$f":"CE34","v":"*:"},{"$f":"CF31","v":"PIT"},"*:",{"$f":"CH31","v":"PIT"},"*:",{"$f":"CJ31","v":"PIT"},"*:",{"$f":"CL31","v":"PIT"},"*:",{"$f":"CN31","v":"PIT"},"*:",{"$f":"CP31","v":"NO"},0,{"$f":"CR31","v":0},{"$f":"CS34","v":0},{"$f":"CT31","v":0},0,0,0,0,0,0,0,0,0,0]
[null,"WAS",null,"WAS",null,{"$f":"F32","v":"WAS"},null,{"$f":"H32","v":"WAS"},null,{"$f":"J32","v":"WAS"},null,{"$f":"L32","v":"WAS"},null,{"$f":"N32","v":"WAS"},null,{"$f":"P32","v":"WAS"},null,{"$f":"R32","v":"WAS"},null,{"$f":"T32","v":"WAS"},null,{"$f":"V32","v":"WAS"},null,{"$f":"X32","v":"WAS"},null,{"$f":"Z32","v":"WAS"},null,{"$f":"AB32","v":"WAS"},null,{"$f":"AD32","v":"WAS"},null,{"$f":"AF32","v":"WAS"},null,{"$f":"AH32","v":"WAS"},null,{"$f":"AJ32","v":"TEN"},null,{"$f":"AL32","v":"WAS"},null,{"$f":"AN32","v":"WAS"},null,{"$f":"AP32","v":"WAS"},null,{"$f":"AR32","v":"WAS"},null,{"$f":"AT32","v":"WAS"},null,{"$f":"AV32","v":"WAS"},null,{"$f":"AX32","v":"TEN"},null,{"$f":"AZ32","v":"TEN"},null,{"$f":"BB32","v":"WAS"},null,{"$f":"BD32","v":"WAS"},null,{"$f":"BF32","v":"WAS"},null,"WAS",null,{"$f":"BJ32","v":"WAS"},null,{"$f":"BL32","v":"WAS"},null,{"$f":"BN32","v":"WAS"},null,{"$f":"BP32","v":"WAS"},null,{"$f":"BR32","v":"WAS"},null,{"$f":"BT32","v":"WAS"},null,{"$f":"BV32","v":"WAS"},null,{"$f":"BX32","v":"WAS"},null,{"$f":"BZ32","v":"LAC"},null,{"$f":"CB32","v":"LAC"},null,{"$f":"CD32","v":"AZ"},null,{"$f":"CF32","v":"LV"},null,{"$f":"CH32","v":"LV"},null,{"$f":"CJ32","v":"LV"},null,{"$f":"CL32","v":"LV"},null,{"$f":"CN32","v":"LV"},null,{"$f":"CP32","v":"IND"},null,{"$f":"CR32","v":0},null,{"$f":"CT32","v":0},null,null,null,null,null,null,null,null,{"$f":"DC35","v":0},0]
[null,"HOU",null,"HOU",null,{"$f":"F33","v":"HOU"},null,{"$f":"H33","v":"HOU"},null,{"$f":"J33","v":"HOU"},null,{"$f":"L33","v":"HOU"},null,{"$f":"N33","v":"HOU"},null,{"$f":"P33","v":"HOU"},null,{"$f":"R33","v":"HOU"},null,{"$f":"T33","v":"HOU"},null,{"$f":"V33","v":"HOU"},null,{"$f":"X33","v":"HOU"},null,{"$f":"Z33","v":"HOU"},null,{"$f":"AB33","v":"HOU"},null,{"$f":"AD33","v":"HOU"},null,{"$f":"AF33","v":"HOU"},null,{"$f":"AH33","v":"HOU"},null,{"$f":"AJ33","v":"HOU"},null,{"$f":"AL33","v":"HOU"},null,{"$f":"AN33","v":"HOU"},null,{"$f":"AP33","v":"HOU"},null,{"$f":"AR33","v":"HOU"},null,{"$f":"AT33","v":"HOU"},null,{"$f":"AV33","v":"HOU"},null,{"$f":"AX33","v":"HOU"},null,{"$f":"AZ33","v":"HOU"},null,{"$f":"BB33","v":"HOU"},null,{"$f":"BD33","v":"HOU"},null,{"$f":"BF33","v":"HOU"},null,"HOU",null,{"$f":"BJ33","v":"HOU"},null,{"$f":"BL33","v":"HOU"},null,{"$f":"BN33","v":"HOU"},null,{"$f":"BP33","v":"HOU"},null,{"$f":"BR33","v":"HOU"},null,{"$f":"BT33","v":"JAX"},null,{"$f":"BV33","v":"HOU"},null,{"$f":"BX33","v":"HOU"},null,{"$f":"BZ33","v":"SEA"},null,{"$f":"CB33","v":"SEA"},null,{"$f":"CD33","v":"SEA"},null,{"$f":"CF33","v":"DAL"},null,{"$f":"CH33","v":"DAL"},null,{"$f":"CJ33","v":"DAL"},null,{"$f":"CL33","v":"DAL"},null,{"$f":"CN33","v":"GB"},null,{"$f":"CP33","v":"GB"},null,{"$f":"CR33","v":0},null,{"$f":"CT33","v":0},null,null,null,null,null,null,null,null,null,null,null,null,null,null,null,null,null,null,null,null,null,null,null,null,null,null,null,null,null,null,null,null,null,null,null,null,null,null,null,null,null,null,null,null,null,null,null,null,null,null,null,null,null,null,null,null,null,null,null,null,null,null,null,null,null,null,null,null,null,null,null,null,null,null,null,null,null,null,null,null,null,null,null,null,null,null,null,null,null,null,null,null,null,null,null,null,null,null,null,null,null,null,null,null,null,null,null,null,null,null,null,null,null,null,null,null,null,null,null,null,null,null,null,null,null,null,null,null,null,null,null,null,null,null,null,null,null,null,null,null,null,null,null,null,null,null,null,null,null,null,null,null,null,null,null,null,null,{"$f":"IV36","v":0}]
[null,"NO",null,"LAR",null,{"$f":"F34","v":"LAR"},null,{"$f":"H34","v":"NO"},null,{"$f":"J34","v":"LAR"},null,{"$f":"L34","v":"LAR"},null,{"$f":"N34","v":"NO"},null,{"$f":"P34","v":"NO"},null,{"$f":"R34","v":"LAR"},null,{"$f":"T34","v":"LAR"},null,{"$f":"V34","v":"LAR"},null,{"$f":"X34","v":"NO"},null,{"$f":"Z34","v":"LAR"},null,{"$f":"AB34","v":"LAR"},null,{"$f":"AD34","v":"LAR"},null,{"$f":"AF34","v":"LAR"},null,{"$f":"AH34","v":"LAR"},null,{"$f":"AJ34","v":"LAR"},null,{"$f":"AL34","v":"LAR"},null,{"$f":"AN34","v":"NO"},null,{"$f":"AP34","v":"LAR"},null,{"$f":"AR34","v":"NO"},null,{"$f":"AT34","v":"LAR"},null,{"$f":"AV34","v":"NO"},null,{"$f":"AX34","v":"LAR"},null,{"$f":"AZ34","v":"LAR"},null,{"$f":"BB34","v":"LAR"},null,{"$f":"BD34","v":"LAR"},null,{"$f":"BF34","v":"LAR"},null,"LAR",null,{"$f":"BJ34","v":"LAR"},null,{"$f":"BL34","v":"LAR"},null,{"$f":"BN34","v":"LAR"},null,{"$f":"BP34","v":"LAR"},null,{"$f":"BR34","v":"LAR"},null,{"$f":"BT34","v":"LAR"},null,{"$f":"BV34","v":"NO"},null,{"$f":"BX34","v":"LAR"},null,{"$f":"BZ34","v":"KC"},null,{"$f":"CB34","v":"KC"},null,{"$f":"CD34","v":"KC"},null,{"$f":"CF34","v":"LAR"},null,{"$f":"CH34","v":"LAR"},null,{"$f":"CJ34","v":"LAR"},null,{"$f":"CL34","v":"LAR"},null,{"$f":"CN34","v":"AZ"},null,{"$f":"CP34","v":"AZ"},null,{"$f":"CR34","v":0},null,{"$f":"CT34","v":0}]
[null,"TB",null,"TB",null,{"$f":"F35","v":"TB"},null,{"$f":"H35","v":"TB"},null,{"$f":"J35","v":"TB"},null,{"$f":"L35","v":"TB"},null,{"$f":"N35","v":"TB"},null,{"$f":"P35","v":"TB"},null,{"$f":"R35","v":"TB"},null,{"$f":"T35","v":"TB"},null,{"$f":"V35","v":"TB"},null,{"$f":"X35","v":"TB"},null,{"$f":"Z35","v":"TB"},null,{"$f":"AB35","v":"TB"},null,{"$f":"AD35","v":"TB"},null,{"$f":"AF35","v":"TB"},null,{"$f":"AH35","v":"TB"},null,{"$f":"AJ35","v":"CAR"},null,{"$f":"AL35","v":"TB"},null,{"$f":"AN35","v":"TB"},null,{"$f":"AP35","v":"TB"},null,{"$f":"AR35","v":"TB"},null,{"$f":"AT35","v":"TB"},null,{"$f":"AV35","v":"TB"},null,{"$f":"AX35","v":"CAR"},null,{"$f":"AZ35","v":"TB"},null,{"$f":"BB35","v":"TB"},null,{"$f":"BD35","v":"TB"},null,{"$f":"BF35","v":"TB"},null,"TB",null,{"$f":"BJ35","v":"TB"},null,{"$f":"BL35","v":"TB"},null,{"$f":"BN35","v":"TB"},null,{"$f":"BP35","v":"TB"},null,{"$f":"BR35","v":"TB"},null,{"$f":"BT35","v":"TB"},null,{"$f":"BV35","v":"TB"},null,{"$f":"BX35","v":"TB"},null,{"$f":"BZ35","v":"SF"},null,{"$f":"CB35","v":"SF"},null,{"$f":"CD35","v":"SF"},null,{"$f":"CF35","v":0},null,{"$f":"CH35","v":0},null,{"$f":"CJ35","v":0},null,{"$f":"CL35","v":0},null,{"$f":"CN35","v":0},null,{"$f":"CP35","v":0},null,{"$f":"CR35","v":0},null,{"$f":"CT35","v":0}]
[null,"PHI",null,"BAL",null,{"$f":"F36","v":"BAL"},null,{"$f":"H36","v":"PHI"},null,{"$f":"J36","v":"PHI"},null,{"$f":"L36","v":"BAL"},null,{"$f":"N36","v":"BAL"},null,{"$f":"P36","v":"BAL"},null,{"$f":"R36","v":"PHI"},null,{"$f":"T36","v":"BAL"},null,{"$f":"V36","v":"PHI"},null,{"$f":"X36","v":"BAL"},null,{"$f":"Z36","v":"PHI"},null,{"$f":"AB36","v":"BAL"},null,{"$f":"AD36","v":"PHI"},null,{"$f":"AF36","v":"PHI"},null,{"$f":"AH36","v":"BAL"},null,{"$f":"AJ36","v":"BAL"},null,{"$f":"AL36","v":"PHI"},null,{"$f":"AN36","v":"PHI"},null,{"$f":"AP36","v":"BAL"},null,{"$f":"AR36","v":"BAL"},null,{"$f":"AT36","v":"BAL"},null,{"$f":"AV36","v":"BAL"},null,{"$f":"AX36","v":"PHI"},null,{"$f":"AZ36","v":"BAL"},null,{"$f":"BB36","v":"BAL"},null,{"$f":"BD36","v":"PHI"},null,{"$f":"BF36","v":"BAL"},null,"BAL",null,{"$f":"BJ36","v":"PHI"},null,{"$f":"BL36","v":"BAL"},null,{"$f":"BN36","v":"BAL"},null,{"$f":"BP36","v":"BAL"},null,{"$f":"BR36","v":"PHI"},null,{"$f":"BT36","v":"PHI"},null,{"$f":"BV36","v":"BAL"},null,{"$f":"BX36","v":"BAL"},null,{"$f":"BZ36","v":"Sunday Night Game"},null,{"$f":"CB36","v":"Sunday Night Game"},null,{"$f":"CD36","v":"Sunday Night Game"},null,{"$f":"CF36","v":0},null,{"$f":"CH36","v":0},null,{"$f":"CJ36","v":0},null,{"$f":"CL36","v":0},null,{"$f":"CN36","v":0},null,{"$f":"CP36","v":0},null,{"$f":"CR36","v":0},null,{"$f":"CT36","v":0}]
[]
[null,{"$f":"B38","v":"BUF"},null,{"$f":"D38","v":"BUF"},null,{"$f":"F38","v":"BUF"},null,{"$f":"H38","v":"BUF"},null,{"$f":"J38","v":"BUF"},null,{"$f":"L38","v":"BUF"},null,{"$f":"N38","v":"BUF"},null,{"$f":"P38","v":"BUF"},null,{"$f":"R38","v":"BUF"},null,{"$f":"T38","v":"BUF"},null,{"$f":"V38","v":"BUF"},null,{"$f":"X38","v":"BUF"},null,{"$f":"Z38","v":"BUF"},null,{"$f":"AB38","v":"BUF"},null,{"$f":"AD38","v":"BUF"},null,{"$f":"AF38","v":"BUF"},null,{"$f":"AH38","v":"BUF"},null,{"$f":"AJ38","v":"BUF"},null,{"$f":"AL38","v":"BUF"},null,{"$f":"AN38","v":"BUF"},null,{"$f":"AP38","v":"BUF"},null,{"$f":"AR38","v":"BUF"},null,{"$f":"AT38","v":"BUF"},null,{"$f":"AV38","v":"BUF"},null,{"$f":"AX38","v":"BUF"},null,{"$f":"AZ38","v":"BUF"},null,{"$f":"BB38","v":"BUF"},null,{"$f":"BD38","v":"BUF"},null,{"$f":"BF38","v":"BUF"},null,{"$f":"BH38","v":"BUF"},null,{"$f":"BJ38","v":"BUF"},null,{"$f":"BL38","v":"BUF"},null,{"$f":"BN38","v":"BUF"},null,{"$f":"BP38","v":"BUF"},null,{"$f":"BR38","v":"BUF"},null,{"$f":"BT38","v":"BUF"},null,{"$f":"BV38","v":"BUF"},null,{"$f":"BX38","v":"BUF"},null,{"$f":"BZ38","v":"Monday Night Game"},null,{"$f":"CB38","v":"Monday Night Game"},null,{"$f":"CD38","v":"Monday Night Game"},null,{"$f":"CF38","v":"LAC"},null,{"$f":"CH38","v":"SF"},null,{"$f":"CJ38","v":"SF"},null,{"$f":"CL38","v":"SF"},null,{"$f":"CN38","v":"SF"},null,{"$f":"CP38","v":"LAC"},null,{"$f":"CR38","v":0},null,{"$f":"CT38","v":0}]
[]
[null,{"$f":"B40","v":"DEN"},null,{"$f":"D40","v":"CLE"},null,{"$f":"F40","v":"DEN"},null,{"$f":"H40","v":"DEN"},null,{"$f":"J40","v":"DEN"},null,{"$f":"L40","v":"DEN"},null,{"$f":"N40","v":"DEN"},null,{"$f":"P40","v":"DEN"},null,{"$f":"R40","v":"DEN"},null,{"$f":"T40","v":"DEN"},null,{"$f":"V40","v":"CLE"},null,{"$f":"X40","v":"DEN"},null,{"$f":"Z40","v":"DEN"},null,{"$f":"AB40","v":"DEN"},null,{"$f":"AD40","v":"DEN"},null,{"$f":"AF40","v":"DEN"},null,{"$f":"AH40","v":"DEN"},null,{"$f":"AJ40","v":"DEN"},null,{"$f":"AL40","v":"DEN"},null,{"$f":"AN40","v":"DEN"},null,{"$f":"AP40","v":"DEN"},null,{"$f":"AR40","v":"DEN"},null,{"$f":"AT40","v":"DEN"},null,{"$f":"AV40","v":"DEN"},null,{"$f":"AX40","v":"DEN"},null,{"$f":"AZ40","v":"DEN"},null,{"$f":"BB40","v":"CLE"},null,{"$f":"BD40","v":"DEN"},null,{"$f":"BF40","v":"DEN"},null,{"$f":"BH40","v":"DEN"},null,{"$f":"BJ40","v":"DEN"},null,{"$f":"BL40","v":"DEN"},null,{"$f":"BN40","v":"DEN"},null,{"$f":"BP40","v":"DEN"},null,{"$f":"BR40","v":"CLE"},null,{"$f":"BT40","v":"DEN"},null,{"$f":"BV40","v":"CLE"},null,{"$f":"BX40","v":"DEN"},null,{"$f":"BZ40","v":36},null,{"$f":"CB40","v":37},null,{"$f":"CD40","v":46},null,{"$f":"CF40","v":"PHI"},null,{"$f":"CH40","v":"PHI"},null,{"$f":"CJ40","v":"PHI"},null,{"$f":"CL40","v":"PHI"},null,{"$f":"CN40","v":"PHI"},null,{"$f":"CP40","v":"PHI"},null,{"$f":"CR40","v":0},null,{"$f":"CT40","v":0}]
[]
[null,"TOTAL",null,"TOTAL",null,"TOTAL",null,"TOTAL",null,"TOTAL",null,"TOTAL",null,"TOTAL",null,"TOTAL",null,"TOTAL",null,"TOTAL",null,"TOTAL",null,"TOTAL",null,"TOTAL",null,"TOTAL",null,"TOTAL",null,"TOTAL",null,"TOTAL",null,"TOTAL",null,"TOTAL",null,"TOTAL",null,"TOTAL",null,"TOTAL",null,"TOTAL",null,"TOTAL",null,"TOTAL",null,"TOTAL",null,"TOTAL",null,"TOTAL",null,"TOTAL",null,"TOTAL",null,"TOTAL",null,"TOTAL",null,"TOTAL",null,"TOTAL",null,"TOTAL",null,"TOTAL",null,"TOTAL",null,"TOTAL",null,"TOTAL",null,"TOTAL",null,"TOTAL",null,"TOTAL",null,"TOTAL",null,"TOTAL",null,"TOTAL",null,"TOTAL",null,"TOTAL",null,"TOTAL",null,"TOTAL"]
[null,{"$f":"B41","v":31},null,{"$f":"D41","v":31},null,{"$f":"F41","v":45},null,{"$f":"H41","v":45},null,{"$f":"J41","v":43},null,{"$f":"L41","v":45},null,{"$f":"N41","v":38},null,{"$f":"P41","v":42},null,{"$f":"R41","v":51},null,{"$f":"T41","v":44},null,{"$f":"V41","v":50},null,{"$f":"X41","v":45},null,{"$f":"Z41","v":48},null,{"$f":"AB41","v":55},null,{"$f":"AD41","v":45},null,{"$f":"AF41","v":49},null,{"$f":"AH41","v":44},null,{"$f":"AJ41","v":44},null,{"$f":"AL41","v":44},null,{"$f":"AN41","v":47},null,{"$f":"AP41","v":44},null,{"$f":"AR41","v":44},null,{"$f":"AT41","v":45},null,{"$f":"AV41","v":44},null,{"$f":"AX41","v":48},null,{"$f":"AZ41","v":47},null,{"$f":"BB41","v":45},null,{"$f":"BD41","v":48},null,{"$f":"BF41","v":62},null,{"$f":"BH41","v":45},null,{"$f":"BJ41","v":40},null,{"$f":"BL41","v":52},null,{"$f":"BN41","v":44},null,{"$f":"BP41","v":46},null,{"$f":"BR41","v":38},null,{"$f":"BT41","v":45},null,{"$f":"BV41","v":39},null,{"$f":"BX41","v":42},null,{"$f":"BZ41","v":48},null,{"$f":"CB41","v":42},null,{"$f":"CD41","v":34},null,{"$f":"CF41","v":53},null,{"$f":"CH41","v":42},null,{"$f":"CJ41","v":42},null,{"$f":"CL41","v":42},null,{"$f":"CN41","v":45},null,{"$f":"CP41","v":35},null,{"$f":"CR41","v":0},null,{"$f":"CT41","v":0}]
[null,{"$f":"B42","v":31},null,{"$f":"D42","v":38},null,{"$f":"F42","v":40},null,{"$f":"H42","v":39},null,{"$f":"J42","v":43},null,{"$f":"L42","v":45},null,{"$f":"N42","v":38},null,{"$f":"P42","v":38},null,{"$f":"R42","v":43},null,{"$f":"T42","v":42},null,{"$f":"V42","v":40},null,{"$f":"X42","v":42},null,{"$f":"Z42","v":39},null,{"$f":"AB42","v":40},null,{"$f":"AD42","v":38},null,{"$f":"AF42","v":42},null,{"$f":"AH42","v":42},null,{"$f":"AJ42","v":42},null,{"$f":"AL42","v":42},null,{"$f":"AN42","v":42},null,{"$f":"AP42","v":41},null,{"$f":"AR42","v":42},null,{"$f":"AT42","v":42},null,{"$f":"AV42","v":45},null,{"$f":"AX42","v":22},null,{"$f":"AZ42","v":38},null,{"$f":"BB42","v":42},null,{"$f":"BD42","v":45},null,{"$f":"BF42","v":51},null,{"$f":"BH42","v":43},null,{"$f":"BJ42","v":44},null,{"$f":"BL42","v":45},null,{"$f":"BN42","v":45},null,{"$f":"BP42","v":38},null,{"$f":"BR42","v":24},null,{"$f":"BT42","v":43},null,{"$f":"BV42","v":39},null,{"$f":"BX42","v":44},null,{"$f":"BZ42","v":"Jack Williams"},null,{"$f":"CB42","v":"Wayne Koopmann"},null,{"$f":"CD42","v":"Chris Cochard"},null,{"$f":"CF42","v":54},null,{"$f":"CH42","v":45},null,{"$f":"CJ42","v":45},null,{"$f":"CL42","v":42},null,{"$f":"CN42","v":45},null,{"$f":"CP42","v":42},null,{"$f":"CR42","v":0},null,{"$f":"CT42","v":0}]
[]
[]
[]
[]
[]
[]
[]
[]
["*","*"]
["IND",{"$f":"A86","v":"IND"},{"$f":"B86","v":"IND"},null,{"$f":"B87","v":"MIN"}]
["MIN",{"$f":"A87","v":"MIN"},{"$f":"B89","v":"BAL"},null,{"$f":"B90","v":"CLE"}]
["*","*",{"$f":"B92","v":"MIA"},null,{"$f":"B93","v":"BUF"}]
["BAL","BAL"]
["CLE","CLE",{"$f":"B96","v":"PHI"},null,{"$f":"B97","v":"CHI"}]
["*","*",{"$f":"B99","v":"ATL"},null,{"$f":"B100","v":"NO"}]
["MIA","MIA",{"$f":"B102","v":"DET"},null,{"$f":"B103","v":"NYJ"}]
["BUF","BUF",{"$f":"B105","v":"PIT"},null,{"$f":"B106","v":"CAR"}]
[null,0,{"$f":"B108","v":"DAL"},null,{"$f":"B109","v":"JAX"}]
["*","*",{"$f":"B111","v":"KC"},null,{"$f":"B112","v":"HOU"}]
["PHI","PHI",{"$f":"B114","v":"AZ"},null,{"$f":"B115","v":"DEN"}]
["CHI","CHI",{"$f":"B117","v":"NE"},null,{"$f":"B118","v":"LV"}]
["*","*",{"$f":"B120","v":"TEN"},null,{"$f":"B121","v":"LAC"}]
["ATL","ATL",{"$f":"B123","v":"CIN"},null,{"$f":"B124","v":"TB"}]
["NO","NO"]
["*","*"]
["DET","DET","GB",null,"PHI"]
["NYJ","NYJ"]
["*","*","PIT",null,"IND"]
["PIT","PIT"]
["CAR","CAR"]
["*","*"]
["DAL","DAL"]
["JAX","JAX"]
["*","*"]
["KC","KC"]
["HOU","HOU"]
["*","*"]
["AZ","AZ"]
["DEN","DEN"]
["*","*"]
["NE","NE"]
["LV","LV"]
["*","*"]
["TEN","TEN"]
["LAC","LAC"]
["*","*"]
["CIN","CIN"]
["TB","TB"]
[null,"*"]
[null,{"$f":"A126","v":0}]
["*",{"$f":"A127","v":"*"}]
["NYG"]
["WAS","*"]
[null,{"$f":"A130","v":0}]
["*",{"$f":"A131","v":"*"}]
["LAR"]
["GB"]
["PIT"]
["IND"]

{"sheet":"Sheet3","index":2,"n_rows":70,"n_cols":8,"rows_kept":70,"cut":false,"hidden":false,"merged":[]}
["Time Submitted",41506.531435185185]
["NE",true,null,null,null,null,null,{"$f":"IF(A2=TRUE,D2,\"\")","v":""}]
["BUF",null,null,null,null,null,null,{"$f":"IF(A3=TRUE,D3,\"\")","v":""}]
["CIN",null,null,null,null,null,null,""]
["CHI",true,null,null,null,null,null,""]
["MIA",null,null,null,null,null,null,""]
["CLE",true,null,null,null,null,null,""]
["ATL",true,null,null,null,null,null,""]
["NO",null,null,null,null,null,null,""]
["TB",null,null,null,null,null,null,""]
["NYJ",true,null,null,null,null,null,""]
["TEN",null,null,null,null,null,null,""]
["PIT",true,null,null,null,null,null,""]
["MIN",null,null,null,null,null,null,""]
["DET",true,null,null,null,null,null,""]
["OAK",true,null,null,null,null,null,""]
["IND",null,null,null,null,null,null,""]
["SEA",true,null,null,null,null,null,""]
["CAR",null,null,null,null,null,null,""]
["KC",null,null,null,null,null,null,""]
["JAC",true,null,null,null,null,null,""]
["AZ",true,null,null,null,null,null,""]
["STL",null,null,null,null,null,null,""]
["GB",null,null,null,null,null,null,""]
["SF",true,null,null,null,null,null,""]
["NYG",null,null,null,null,null,null,""]
["DAL",null,null,null,null,null,null,""]
["PHI",null,null,null,null,null,null,""]
["WAS",true,null,null,null,null,null,""]
["HOU",null,null,null,null,null,null,""]
["SD",true,null,null,null,null,null,""]
["Tie Breaker Total Score:","45"]
["Column1","Wayne"]
["Column2","70"]
[null,"wayne@yahoo.com"]
[]
[null,{"$f":"IF(B2=TRUE,A2,\"\")","v":"NE"}]
[null,{"$f":"IF(B3=TRUE,A3,\"\")","v":""}]
[null,""]
[null,"CHI"]
[null,""]
[null,"CLE"]
[null,"ATL"]
[null,""]
[null,""]
[null,"NYJ"]
[null,""]
[null,"PIT"]
[null,""]
[null,"DET"]
[null,"OAK"]
[null,""]
[null,"SEA"]
[null,""]
[null,""]
[null,"JAC"]
[null,"AZ"]
[null,""]
[null,""]
[null,"SF"]
[null,""]
[null,""]
[null,""]
[null,"WAS"]
[null,""]
[null,"SD"]
[null,{"$f":"B32","v":"45"}]
[null,{"$f":"B33","v":"Wayne"}]
[]
["output"]